{"text_format":"1","workbook":"xlsx","n_sheets":11,"sheets":["Interface","OUTPUT","Print","D","LG","L","Rdc","Sheet1","Sheet2","In-air-GRD","Sheet4"],"not_rendered":{"charts":0,"images":5,"macros":1,"external_links":2,"defined_names":106,"comments":1,"pivot_tables":0},"unopened":[],"bounds":{"document_bytes":16777216,"sheet_cells":100000,"rows_first":2000,"rows_last":500,"rows_between":2000,"halvings":0,"cell_chars":16384,"cell_head_chars":4096},"cells_cut":0,"cells_raw":0,"read":"whole","date_system":"1900"}

{"sheet":"Interface","index":0,"n_rows":95,"n_cols":8,"rows_kept":95,"cut":false,"hidden":false,"merged":[[4,3,4,5],[87,2,87,5],[8,2,8,3],[10,2,10,3],[74,2,74,3],[12,2,12,3],[21,2,21,3],[22,2,22,3],[23,2,23,3],[44,2,44,5],[34,4,34,5],[38,4,38,5],[66,3,66,4]]}
[]
[]
[]
[]
[null,null,null,"Select Language"]
[]
[null,{"$f":"OFFSET(LG!A2,LG!B8-1,0,1,1)","v":"VOLTAGE DROP CALCULATION (Yazaki Cable)"}]
[]
[null,{"$f":"OFFSET(LG!I2,LG!B8-1,0,1,1)","v":"Type of Voltage Drop"},"AC 3-Phase,  3-Wire"]
[]
[null,{"$f":"OFFSET(LG!B2,LG!B8-1,0,1,1)","v":"Type of Cable"},"Building Wire Cable",null,null,"Color Meaning"]
[]
[null,{"$f":"OFFSET(LG!C2,LG!B8-1,0,1,1)","v":"Cable Name"},"60227 IEC 01 THW",null,null,null,{"$f":"OFFSET(LG!AZ2,LG!B8-1,0,1,1)","v":"Input Data"}]
[]
[null,{"$f":"OFFSET(LG!D2,LG!B8-1,0,1,1)","v":"Select No. of Core"},1,null,null,null,{"$f":"OFFSET(LG!BA2,LG!B8-1,0,1,1)","v":"Select Data"}]
[]
[null,{"$f":"D!B69","v":"Select Size"},150,{"$f":"D!C69","v":"mm²"},null,null,{"$f":"OFFSET(LG!BB2,LG!B8-1,0,1,1)","v":"Do not Edit"}]
[null,{"$f":"D!B70","v":""},185,{"$f":"D!C70","v":""}]
[null,{"$f":"D!B71","v":""},400,{"$f":"D!C71","v":""}]
[null,{"$f":"D!B72","v":""},6,{"$f":"D!C72","v":""}]
[]
[null,{"$f":"D!C76","v":"Select Laying type"},"Space",null,{"$f":"IF(AND(D!H66=1,C22=\"Space\"),\"(Spacing : S=2D)\",\"\")","v":"(Spacing : S=2D)"}]
[null,{"$f":"D!C75","v":""},{"$f":"D!B75","v":""}]
[null,{"$f":"D!C77","v":""},{"$f":"D!B76","v":""}]
[]
[null,{"$f":"OFFSET(LG!G2,LG!B8-1,0,1,1)","v":"Frequency 50 Hz (Thailand, Myanmar, Cambodia,China)"}]
[]
[null,{"$f":"OFFSET(LG!H2,LG!B8-1,0,1,1)","v":"Power Factor"},0.85,{"$f":"IF(C28=0.85,\"(Recommendation by MEA, EIT)\",\"\")","v":"(Recommendation by MEA, EIT)"}]
[]
[]
[null,{"$f":"OFFSET(LG!P2,LG!B8-1,0,1,1)","v":"Part of System"},"Main Feeder"]
[]
[null,{"$f":"OFFSET(LG!BD2,LG!B8-1,0,1,1)","v":"Cable/Phase"},6]
[]
[null,{"$f":"OFFSET(LG!J2,LG!B8-1,0,1,1)","v":"Length of Cable"},99,{"$f":"OFFSET(LG!K2,LG!B8-1,0,1,1)","v":"Metre"},{"$f":"OFFSET(LG!AV2,LG!B8-1,0,1,1)","v":"Installation"},null,"Air"]
[]
[null,{"$f":"OFFSET(LG!L2,LG!B8-1,0,1,1)","v":"Current"},99,{"$f":"OFFSET(LG!M2,LG!B8-1,0,1,1)","v":"A"},{"$f":"OFFSET(LG!AW2,LG!B8-1,0,1,1)","v":"Maximum Capacity"},null,{"$f":"IF(AND(D!F40=27,C15>4),\"N/A\",IF(C33=1,ROUND('In-air-GRD'!H14,0),\"N/A\"))","v":"N/A"},"A"]
[]
[null,{"$f":"OFFSET(LG!N2,LG!B8-1,0,1,1)","v":"System Voltage"},400,{"$f":"OFFSET(LG!O2,LG!B8-1,0,1,1)","v":"V"},{"$f":"OFFSET(LG!AX2,LG!B8-1,0,1,1)","v":"Ambient"},null,"41-45","°C"]
[]
[null,{"$f":"OFFSET(LG!Q2,LG!B8-1,0,1,1)","v":"Voltage Drop"},{"$f":"IF(D!C59>0.00001,D!C59,\"\")","v":0.55679309242507635},{"$f":"OFFSET(LG!R2,LG!B8-1,0,1,1)","v":"V"}]
[]
[null,{"$f":"OFFSET(LG!S2,LG!B8-1,0,1,1)","v":"Voltage Drop"},{"$f":"IF(C39=\"\",\"\",((C41*100)/C39))","v":0.13919827310626909},{"$f":"OFFSET(LG!T2,LG!B8-1,0,1,1)","v":"%"}]
[]
[null,{"$f":"OFFSET(LG!U2,LG!B8-1,0,1,1)","v":"Result"},{"$f":"IF(C43=\"\",\"\",OFFSET(LG!AU2,LG!B8-1,0,1,1))","v":"Can Use"}]
[null,{"$f":"IF(AND(G37=\"N/A\",C13=\"CVV\",C33>1),\"Remark: maximum capacity of cable must be calculated by suitable method\",IF(AND(G37=\"N/A\",C13=\"CVV\"),\"\",IF(G37=\"N/A\",\"Remark: maximum capacity of cable must be calculated by suitable method\",IF(C33>1,\"Remark: maximum capacity of cable must be calculated by suitable method\",IF(AND(G37=\"N/A\",C13=\"CVV\",C33>1),\"Remark: maximum capacity of cable must be calculated by suitable method\",\"\")))))","v":"Remark: maximum capacity of cable must be calculated by suitable method"}]
[]
[]
[{"$f":"OFFSET(LG!AP2,LG!B8-1,0,1,1)","v":"NOTE: NEC RECOMMENDATIONS "}]
[{"$f":"OFFSET(LG!AQ2,LG!B8-1,0,1,1)","v":" Maximum combined voltage drop for both the feeder and branch circuit shouldn't "}]
[{"$f":"OFFSET(LG!AR2,LG!B8-1,0,1,1)","v":"exceed 5%, and the maximum on the feeder or branch circuit shouldn't exceed 3%"}]
[{"$f":"OFFSET(LG!AS2,LG!B8-1,0,1,1)","v":""}]
[{"$f":"OFFSET(LG!AT2,LG!B8-1,0,1,1)","v":""}]
[]
[]
[]
[]
[]
[]
[null,{"$f":"OFFSET(LG!V2,LG!B8-1,0,1,1)","v":"VOLTAGE DROP CALCULATION (Other Cable)"}]
[]
[null,{"$f":"B37","v":"Current"},null,{"$f":"D37","v":"A"},null,"Color Meaning"]
[]
[null,{"$f":"B35","v":"Length of Cable"},null,{"$f":"D35","v":"Metre"},null,null,{"$f":"G13","v":"Input Data"}]
[]
[null,null,null,null,null,null,{"$f":"G15","v":"Select Data"}]
[null,{"$f":"OFFSET(LG!AA2,LG!B8-1,0,1,1)","v":"AC Resistance"},null,{"$f":"OFFSET(LG!AB2,LG!B8-1,0,1,1)","v":"Ω/km"}]
[null,null,null,null,null,null,{"$f":"G17","v":"Do not Edit"}]
[null,{"$f":"OFFSET(LG!AC2,LG!B8-1,0,1,1)","v":"Reactance XL"},null,{"$f":"D67","v":"Ω/km"}]
[]
[null,{"$f":"B28","v":"Power Factor"},0.85,{"$f":"IF(C71=0.85,\"(Recommandation by MEA, EIT)\",\"\")","v":"(Recommandation by MEA, EIT)"}]
[]
[null,{"$f":"OFFSET(LG!AE2,LG!B8-1,0,1,1)","v":"Impedance"},{"$f":"(C67*C71+C69*(SIN(ACOS(C71))))","v":0},{"$f":"D69","v":"Ω/km"}]
[]
[null,{"$f":"B9","v":"Type of Voltage Drop"},"AC 3-Phase,  3-Wire"]
[null,"Voltage Drop 3 ph.",{"$f":"SQRT(3)*C73*(C64/1000)*C62","v":0}]
[null,"Voltage drop  1 Ph.",{"$f":"2*C73*(C64/1000)*C62","v":0}]
[]
[null,{"$f":"B39","v":"System Voltage"},400,{"$f":"D41","v":"V"}]
[]
[null,{"$f":"B31","v":"Part of System"},"Main Feeder"]
[]
[null,{"$f":"B41","v":"Voltage Drop"},{"$f":"IF(C75=\"AC 3-Phase,  3-Wire\",C76,C77)","v":0},{"$f":"D79","v":"V"}]
[]
[null,{"$f":"B43","v":"Voltage Drop"},{"$f":"((C83*100)/C79)","v":0},{"$f":"D43","v":"%"}]
[]
[]
[null,{"$f":"B45","v":"Result"},{"$f":"OFFSET(LG!AY2,LG!B8-1,0,1,1)","v":"Can Use"}]
[]
[]
[{"$f":"A49","v":"NOTE: NEC RECOMMENDATIONS "}]
[{"$f":"A50","v":" Maximum combined voltage drop for both the feeder and branch circuit shouldn't "}]
[{"$f":"A51","v":"exceed 5%, and the maximum on the feeder or branch circuit shouldn't exceed 3%"}]
[{"$f":"A52","v":""}]
[{"$f":"A53","v":""}]

{"sheet":"OUTPUT","index":1,"n_rows":709,"n_cols":20,"rows_kept":709,"cut":false,"hidden":false,"merged":[[5,1,5,3]]}
[]
[]
[]
[]
["VOLTAGE DROP"]
["Cable Name","Core x Size",null,null,"laying type","P.F.","Type of Voltage Drop","Cable/Phase","Length","Current","Voltage system","Part of system","Voltage drop","% Voltage","Installation","Maximum capacity","Ambient","Result","Print out"]
[null,null,null,null,null,null,null,null,null,null,null,null,null,null,null,null,null,null,null,true]
[null,null,null,null,null,null,null,null,null,null,null,null,null,null,null,null,null,null,null,true]
[null,null,null,null,null,null,null,null,null,null,null,null,null,null,null,null,null,null,null,true]
[null,null,null,null,null,null,null,null,null,null,null,null,null,null,null,null,null,null,null,true]
[]
[]
[]
[]
[]
[]
[]
[]
[]
[]
[]
[]
[]
[]
[]
[]
[]
[]
[]
[]
[]
[]
[]
[]
[]
[]
[]
[]
[]
[]
[]
[]
[]
[]
[]
[]
[]
[]
[]
[]
[]
[]
[]
[]
[]
[]
[]
[]
[]
[]
[]
[]
[]
[]
[]
[]
[]
[]
[]
[]
[]
[]
[]
[]
[]
[]
[]
[]
[]
[]
[]
[]
[]
[]
[]
[]
[]
[]
[]
[]
[]
[]
[]
[]
[]
[]
[]
[]
[]
[]
[]
[]
[]
[]
[]
[]
[]
[]
[]
[]
[]
[]
[]
[]
[]
[]
[]
[]
[]
[]
[]
[]
[]
[]
[]
[]
[]
[]
[]
[]
[]
[]
[]
[]
[]
[]
[]
[]
[]
[]
[]
[]
[]
[]
[]
[]
[]
[]
[]
[]
[]
[]
[]
[]
[]
[]
[]
[]
[]
[]
[]
[]
[]
[]
[]
[]
[]
[]
[]
[]
[]
[]
[]
[]
[]
[]
[]
[]
[]
[]
[]
[]
[]
[]
[]
[]
[]
[]
[]
[]
[]
[]
[]
[]
[]
[]
[]
[]
[]
[]
[]
[]
[]
[]
[]
[]
[]
[]
[]
[]
[]
[]
[]
[]
[]
[]
[]
[]
[]
[]
[]
[]
[]
[]
[]
[]
[]
[]
[]
[]
[]
[]
[]
[]
[]
[]
[]
[]
[]
[]
[]
[]
[]
[]
[]
[]
[]
[]
[]
[]
[]
[]
[]
[]
[]
[]
[]
[]
[]
[]
[]
[]
[]
[]
[]
[]
[]
[]
[]
[]
[]
[]
[]
[]
[]
[]
[]
[]
[]
[]
[]
[]
[]
[]
[]
[]
[]
[]
[]
[]
[]
[]
[]
[]
[]
[]
[]
[]
[]
[]
[]
[]
[]
[]
[]
[]
[]
[]
[]
[]
[]
[]
[]
[]
[]
[]
[]
[]
[]
[]
[]
[]
[]
[]
[]
[]
[]
[]
[]
[]
[]
[]
[]
[]
[]
[]
[]
[]
[]
[]
[]
[]
[]
[]
[]
[]
[]
[]
[]
[]
[]
[]
[]
[]
[]
[]
[]
[]
[]
[]
[]
[]
[]
[]
[]
[]
[]
[]
[]
[]
[]
[]
[]
[]
[]
[]
[]
[]
[]
[]
[]
[]
[]
[]
[]
[]
[]
[]
[]
[]
[]
[]
[]
[]
[]
[]
[]
[]
[]
[]
[]
[]
[]
[]
[]
[]
[]
[]
[]
[]
[]
[]
[]
[]
[]
[]
[]
[]
[]
[]
[]
[]
[]
[]
[]
[]
[]
[]
[]
[]
[]
[]
[]
[]
[]
[]
[]
[]
[]
[]
[]
[]
[]
[]
[]
[]
[]
[]
[]
[]
[]
[]
[]
[]
[]
[]
[]
[]
[]
[]
[]
[]
[]
[]
[]
[]
[]
[]
[]
[]
[]
[]
[]
[]
[]
[]
[]
[]
[]
[]
[]
[]
[]
[]
[]
[]
[]
[]
[]
[]
[]
[]
[]
[]
[]
[]
[]
[]
[]
[]
[]
[]
[]
[]
[]
[]
[]
[]
[]
[]
[]
[]
[]
[]
[]
[]
[]
[]
[]
[]
[]
[]
[]
[]
[]
[]
[]
[]
[]
[]
[]
[]
[]
[]
[]
[]
[]
[]
[]
[]
[]
[]
[]
[]
[]
[]
[]
[]
[]
[]
[]
[]
[]
[]
[]
[]
[]
[]
[]
[]
[]
[]
[]
[]
[]
[]
[]
[]
[]
[]
[]
[]
[]
[]
[]
[]
[]
[]
[]
[]
[]
[]
[]
[]
[]
[]
[]
[]
[]
[]
[]
[]
[]
[]
[]
[]
[]
[]
[]
[]
[]
[]
[]
[]
[]
[]
[]
[]
[]
[]
[]
[]
[]
[]
[]
[]
[]
[]
[]
[]
[]
[]
[]
[]
[]
[]
[]
[]
[]
[]
[]
[]
[]
[]
[]
[]
[]
[]
[]
[]
[]
[]
[]
[]
[]
[]
[]
[]
[]
[]
[]
[]
[]
[]
[]
[]
[]
[]
[]
[]
[]
[]
[]
[]
[]
[]
[]
[]
[]
[]
[]
[]
[]
[]
[]
[]
[]
[]
[]
[]
[]
[]
[]
[]
[]
[]
[]
[]
[]
[]
[]
[]
[]
[]
[]
[]
[]
[]
[]
[]
[]
[]
[]
[]
[]
[]
[]
[]
[null,null,null,null,null,null,null,null,null,null,null,null,null,null,null,true]

{"sheet":"Print","index":2,"n_rows":6,"n_cols":18,"rows_kept":6,"cut":false,"hidden":false,"merged":[[5,1,5,3]]}
[]
[]
[]
[]
["VOLTAGE DROP"]
["Cable Name","Core x Size",null,null,"laying type","P.F.","Type of Voltage Drop","Cable/Phase","Length","Current","Voltage system","Part of system","Voltage drop","% Voltage","Installation","Maximum capacity","Ambient","Result"]

{"sheet":"D","index":3,"n_rows":82,"n_cols":264,"rows_kept":82,"cut":false,"hidden":true,"merged":[[1,54,2,54],[1,130,1,131],[1,132,1,133],[1,134,2,134],[31,217,31,219],[31,220,31,222],[31,224,31,226],[31,227,31,229],[1,179,1,180],[1,181,2,181],[1,182,1,183],[1,157,1,158],[31,73,31,75],[31,76,31,78],[1,90,1,91],[1,92,1,93],[1,94,1,95],[31,90,31,92],[31,93,31,95],[1,137,1,138],[1,139,1,140],[1,141,2,141],[1,142,1,143],[1,144,2,144],[60,5,60,7],[31,50,31,53],[31,55,31,56],[31,57,31,58],[31,60,31,63],[31,64,31,67],[31,99,31,101],[31,103,31,105],[31,106,31,108],[31,20,31,22],[31,28,31,30],[31,31,31,33],[31,39,31,41],[31,42,31,44],[31,46,31,49],[31,9,31,11],[31,17,31,19],[32,6,32,8],[32,9,32,11],[31,79,31,81],[31,82,31,84],[31,96,31,98],[31,6,31,8],[1,197,1,198],[1,172,1,173],[1,149,1,150],[1,189,1,190],[1,191,2,191],[1,175,1,176],[1,192,1,193],[31,114,31,116],[31,117,31,119],[31,121,31,123],[1,145,1,146],[1,174,2,174],[1,118,1,119],[1,120,2,120],[31,165,31,167],[31,168,31,170],[31,175,31,177],[31,178,31,180],[31,185,31,187],[31,188,31,190],[1,201,1,202],[1,151,2,151],[1,152,1,153],[1,154,2,154],[1,155,1,156],[1,159,1,160],[1,161,2,161],[1,135,1,136],[1,62,1,63],[1,194,2,194],[1,199,1,200],[1,147,1,148],[1,121,1,122],[1,123,1,124],[1,125,1,126],[1,127,2,127],[1,128,1,129],[1,69,1,70],[1,71,1,72],[1,86,1,87],[1,88,1,89],[1,110,1,111],[1,112,1,113],[1,195,1,196],[1,236,2,236],[1,237,1,238],[1,212,1,213],[1,214,1,215],[1,216,2,216],[1,217,1,218],[1,223,2,223],[1,224,1,225],[1,230,2,230],[1,231,1,232],[1,233,2,233],[1,234,1,235],[1,219,1,220],[1,221,1,222],[1,226,1,227],[1,228,1,229],[1,43,1,44],[1,45,2,45],[1,46,1,47],[1,64,1,65],[1,100,1,101],[1,102,2,102],[1,66,1,67],[1,68,2,68],[1,73,1,74],[1,79,1,80],[1,81,1,82],[1,83,1,84],[1,85,2,85],[1,96,1,97],[1,75,1,76],[1,77,1,78],[1,48,1,49],[1,50,1,51],[1,52,1,53],[1,98,1,99],[1,55,1,56],[1,57,1,58],[1,59,2,59],[1,60,1,61],[1,1,2,1],[1,6,1,7],[1,8,1,9],[1,10,1,11],[1,12,2,12],[1,17,1,18],[1,34,2,34],[1,39,1,40],[1,41,1,42],[1,19,1,20],[1,21,1,22],[1,23,2,23],[1,28,1,29],[1,30,1,31],[1,32,1,33],[1,2,1,3],[1,4,1,5],[1,13,1,14],[1,15,1,16],[1,24,1,25],[1,26,1,27],[1,35,1,36],[1,37,1,38],[31,213,31,215],[31,202,31,204],[31,210,31,212],[1,103,1,104],[1,105,1,106],[1,107,1,108],[1,109,2,109],[1,114,1,115],[1,116,1,117],[1,177,1,178],[1,162,1,163],[1,164,2,164],[1,165,1,166],[1,167,1,168],[1,169,1,170],[1,171,2,171],[1,203,1,204],[1,205,2,205],[1,210,1,211],[1,184,2,184],[1,185,1,186],[1,187,1,188],[1,206,1,207],[1,208,1,209],[31,199,31,201],[31,124,31,126],[31,128,31,130],[31,131,31,133],[31,135,31,137],[31,138,31,140],[31,145,31,147],[31,148,31,150],[31,155,31,157],[31,158,31,160],[1,239,2,239],[1,240,1,241],[1,242,1,243],[1,244,1,245],[1,246,1,247],[1,248,1,249],[1,250,2,250],[1,251,1,252],[1,253,1,254],[1,255,1,256],[1,257,2,257],[1,258,1,259],[1,260,1,261],[1,262,1,263],[31,244,31,246],[31,247,31,249],[31,251,31,253],[31,254,31,256],[31,258,31,260],[31,261,31,263]]}
[null,null,null,null,2,null,null,null,null,null,3]
[null,"60227 IEC 01 THW","Touch 2",null,"Spacing",null,"Trefoil",null,"Flat",null,"Spacing",null,"60227 IEC 01 THW (f)","Touch 2",null,"Spacing",null,"Trefoil",null,"Touching 3",null,"Spacing",null,"60227 IEC 05 IV","Touch 2",null,"Spacing",null,"Trefoil",null,"Touching 3",null,"Spacing",null,"60227 IEC 06 IV (f)","Touch 2",null,"Spacing",null,"Trefoil",null,"Touching 3",null,"Spacing",null,"60227 IEC 10 ","2C ",null,"3C ",null,"4C ",null,"5C ",null,"60227 IEC 52 VCT","2C ",null,"3C ",null,"60227 IEC 53 VCT","2C ",null,"3C ",null,"4C ",null,"5C ",null,"NYY","Touch 2",null,"Spacing",null,"Trefoil",null,"Touching",null,"Spacing",null,"2C",null,"3C ",null,"4C ",null,"VCT","Touch 2",null,"Spacing",null,"Trefoil",null,"Touching",null,"Spacing",null,"2C ",null,"3C ",null,"4C ",null,"NYY-SWA","2C ",null,"3C ",null,"4C ",null,"FD-0.6/1KV-CV","Touch 2",null,"Spacing",null,"Trefoil",null,"Touching 3",null,"Spacing",null,"FD-0.6/1KV-CV","2C",null,"3C",null,"4C",null,"FD-0.6/1KV-CV-SWA","2C ",null,"3C ",null,"4C ",null,"1.8/3KV-CV","Trefoil",null,"Touching 3",null,"Spacing",null,"1.8/3KV-CV","3C",null,"3.6/6KV-CV","Trefoil",null,"Touching 3",null,"Spacing",null,"3.6/6KV-CV","3C",null,"6/10KV-CV","Trefoil",null,"Touching 3",null,"Spacing",null,"6/10KV-CV","3C",null,"12/20KV-CV","Trefoil",null,"Touching 3",null,"Spacing",null,"12/20KV-CV","3C",null,"8.7/15KV-CV","Trefoil",null,"Touching 3",null,"Spacing",null,"8.7/15KV-CV","3C",null,"18/30KV-CV","Trefoil",null,"Touching 3",null,"Spacing",null,"18/30KV-CV","3C",null,"THWA","Touch 2",null,"Spacing",null,"Trefoil",null,"Touching 3",null,"Spacing",null,"THWA-C","Touch 2",null,"Spacing",null,"Trefoil",null,"Touching 3",null,"Spacing",null,"69KV-CE","Trefoil",null,"Touching 3",null,"Spacing",null,"115KV-CE","Trefoil",null,"Touching 3",null,"Spacing",null,"15KV-CC","1C",null,"25KV-CC","1C",null,"35KV-CC","1C",null,"FD-0.6/1KV-AL-CV","Touch 2",null,"Spacing",null,"Trefoil",null,"Touching 3",null,"Spacing",null,"FD-0.6/1KV-AL-CV","2C",null,"3C",null,"4C",null,"CVV","2C",null,"3C",null,"4-48C"]
[null,null,"Rac","XL","Rac","XL","Rac","XL","Rac","XL","Rac","XL",null,"Rac","XL","Rac","XL","Rac","XL","Rac","XL","Rac","XL",null,"Rac","XL","Rac","XL","Rac","XL","Rac","XL","Rac","XL",null,"Rac","XL","Rac","XL","Rac","XL","Rac","XL","Rac","XL",null,"Rac","XL","Rac","XL","Rac","XL","Rac","XL",null,"Rac","XL","Rac","XL",null,"Rac","XL","Rac","XL","Rac","XL","Rac","XL",null,"Rac","XL","Rac","XL","Rac","XL","Rac","XL","Rac","XL","Rac","XL","Rac","XL","Rac","XL",null,"Rac","XL","Rac","XL","Rac","XL","Rac","XL","Rac","XL","Rac","XL","Rac","XL","Rac","XL",null,"Rac","XL","Rac","XL","Rac","XL",null,"Rac","XL","Rac","XL","Rac","XL","Rac","XL","Rac","XL",null,"Rac","XL","Rac","XL","Rac","XL",null,"Rac","XL","Rac","XL","Rac","XL",null,"Rac","XL","Rac","XL","Rac","XL",null,"Rac","XL",null,"Rac","XL","Rac","XL","Rac","XL",null,"Rac","XL",null,"Rac","XL","Rac","XL","Rac","XL",null,"Rac","XL",null,"Rac","XL","Rac","XL","Rac","XL",null,"Rac","XL",null,"Rac","XL","Rac","XL","Rac","XL",null,"Rac","XL",null,"Rac","XL","Rac","XL","Rac","XL",null,"Rac","XL",null,"Rac","XL","Rac","XL","Rac","XL","Rac","XL","Rac","XL",null,"Rac","XL","Rac","XL","Rac","XL","Rac","XL","Rac","XL",null,"Rac","XL","Rac","XL","Rac","XL",null,"Rac","XL","Rac","XL","Rac","XL",null,"Rac","XL",null,"Rac","XL",null,"Rac","XL",null,"Rac","XL","Rac","XL","Rac","XL","Rac","XL","Rac","XL",null,"Rac","XL","Rac","XL","Rac","XL",null,"Rac","XL","Rac","XL","Rac","XL"]
[1,0.5,null,null,null,null,null,null,null,null,null,null,0.5,null,null,null,null,null,null,null,null,null,null,0.5,43.074002393448112,0.12180427420802757,43.074002030433007,0.16535599601409962,43.074002979755207,0.12406194893229398,43.074002581363487,0.1385831266270354,43.07400207669582,0.18213484843310745,0.5,46.663502275107923,0.11918632091785733,46.663501890688664,0.16273804272392939,46.663502982984809,0.11748986088491885,46.663502528131659,0.13201103857966023,46.66350195294028,0.17556276038573232,0.5,null,null,null,null,null,null,null,null,0.5,46.663502715654495,0.11371923486327029,46.663503218022477,0.11371923486327029,0.5,null,null,null,null,null,null,null,null,0.5,null,null,null,null,null,null,null,null,null,null,null,null,null,null,null,null,0.5,null,null,null,null,null,null,null,null,null,null,null,null,null,null,null,null,0.5,null,null,null,null,null,null,0.5,null,null,null,null,null,null,null,null,null,null,0.5,null,null,null,null,null,null,0.5,null,null,null,null,null,null,0.5,null,null,null,null,null,null,0.5,null,null,0.5,null,null,null,null,null,null,0.5,null,null,0.5,null,null,null,null,null,null,0.5,null,null,0.5,null,null,null,null,null,null,0.5,null,null,0.5,null,null,null,null,null,null,0.5,null,null,0.5,null,null,null,null,null,null,0.5,null,null,0.5,null,null,null,null,null,null,null,null,null,null,0.5,null,null,null,null,null,null,null,null,null,null,0.5,null,null,null,null,null,null,0.5,null,null,null,null,null,null,0.5,null,null,0.5,null,null,0.5,null,null,0.5,null,null,null,null,null,null,null,null,null,null,0.5,null,null,null,null,null,null,0.5,46.663502275107923,0.11918632091785733,46.663502543627949,7.1002702661052755E-2,46.663502543627949,7.1002702661052755E-2]
[2,0.75,null,null,null,null,null,null,null,null,null,null,0.75,null,null,null,null,null,null,null,null,null,null,0.75,29.314253709745643,0.1142670081483919,29.314253031703885,0.15781872995446397,29.314254960876511,0.1142670081483919,29.314254157051213,0.12878818584313331,29.31425314156747,0.17233990764920537,0.75,31.109003603797071,0.11139438391106463,31.109002883816707,0.15494610571713668,31.10900493586794,0.11051473796805948,31.109004080179862,0.12503591566280087,31.109003000563803,0.16858763746887293,0.75,null,null,null,null,null,null,null,null,0.75,31.109004404191815,0.10636515226305227,31.109005340224975,0.10636515226305227,0.75,31.109004404191815,0.10636515226305227,31.109005340224975,0.10636515226305227,31.109005340224975,0.10636515226305227,31.109005340224975,0.10636515226305227,0.75,null,null,null,null,null,null,null,null,null,null,null,null,null,null,null,null,0.75,null,null,null,null,null,null,null,null,null,null,null,null,null,null,null,null,0.75,null,null,null,null,null,null,0.75,null,null,null,null,null,null,null,null,null,null,0.75,null,null,null,null,null,null,0.75,null,null,null,null,null,null,0.75,null,null,null,null,null,null,0.75,null,null,0.75,null,null,null,null,null,null,0.75,null,null,0.75,null,null,null,null,null,null,0.75,null,null,0.75,null,null,null,null,null,null,0.75,null,null,0.75,null,null,null,null,null,null,0.75,null,null,0.75,null,null,null,null,null,null,0.75,null,null,0.75,null,null,null,null,null,null,null,null,null,null,0.75,null,null,null,null,null,null,null,null,null,null,0.75,null,null,null,null,null,null,0.75,null,null,null,null,null,null,0.75,null,null,0.75,null,null,0.75,null,null,0.75,null,null,null,null,null,null,null,null,null,null,0.75,null,null,null,null,null,null,0.75,31.109003603797071,0.11139438391106463,31.109004110732076,0.11918632091785733,31.109004110732076,0.11918632091785733]
[3,1,null,null,null,null,null,null,null,null,null,null,1,null,null,null,null,null,null,null,null,null,null,1,21.656655176724737,0.11051473796805948,21.656654142498851,0.15406645977413153,21.656657090195374,0.11051473796805948,21.656655861030664,0.12503591566280087,21.656654310201596,0.16858763746887293,1,23.331755041827567,0.10606234756579784,23.331753904280006,0.14961406937186988,23.3317571556858,0.1051827016227927,23.331755798158337,0.1197038793175341,23.331754088965557,0.16325560112360615,1,null,null,null,null,null,null,null,null,1,null,null,null,null,1,23.331756080793063,0.10369105282309819,23.331757445330041,0.10369105282309819,23.331757445330041,0.10369105282309819,23.331757445330041,0.10369105282309819,1,21.656653826812953,0.23177592716990827,21.656653913981124,0.18822420536383622,21.656654071754886,0.18822420536383622,21.656653970268028,0.20274538305857762,21.65665384086061,0.24629710486464965,null,null,null,null,null,null,1,null,null,null,null,null,null,null,null,null,null,null,null,null,null,null,null,1,null,null,null,null,null,null,1,null,null,null,null,null,null,null,null,null,null,1,null,null,null,null,null,null,1,null,null,null,null,null,null,1,null,null,null,null,null,null,1,null,null,1,null,null,null,null,null,null,1,null,null,1,null,null,null,null,null,null,1,null,null,1,null,null,null,null,null,null,1,null,null,1,null,null,null,null,null,null,1,null,null,1,null,null,null,null,null,null,1,null,null,1,null,null,null,null,null,null,null,null,null,null,1,null,null,null,null,null,null,null,null,null,null,1,null,null,null,null,null,null,1,null,null,null,null,null,null,1,null,null,1,null,null,1,null,null,1,null,null,null,null,null,null,null,null,null,null,1,null,null,null,null,null,null,1,23.331755041827567,0.10606234756579784,23.331755848674636,0.11139438391106463,23.331755848674636,0.11139438391106463]
[4,1.5,14.477658138242305,0.10501625953057019,14.477656295266431,0.14856798133664223,14.477661563472035,0.10501625953057019,14.477659363795132,0.119537437225312,14.477656594492636,0.16308915903138363,1.5,15.91345756650167,0.10369105282309819,15.913455767906898,0.14724277462917024,15.913460916080066,0.10369105282309819,15.913458765252859,0.11821223051783959,15.913456060097094,0.16176395232391161,1.5,null,null,null,null,null,null,null,null,null,null,1.5,null,null,null,null,null,null,null,null,null,null,1.5,14.476599999999999,0.10592,14.476599999999999,0.10592,14.47766,0.11862,14.47766,0.11862,1.5,null,null,null,null,1.5,15.91345916109279,0.10169622327537571,15.913461299920872,0.10169622327537571,15.913461299920872,0.10169622327537571,15.913461299920872,0.10169622327537571,1.5,14.477655742915418,0.22062999559237759,14.477655928838249,0.1770782737863055,14.477656265649168,0.1770782737863055,14.477656049009381,0.19159945148104693,14.47765577288498,0.23515117328711896,null,null,null,null,null,null,1.5,null,null,null,null,null,null,null,null,null,null,null,null,null,null,null,null,1.5,null,null,null,null,null,null,1.5,15.428715960957714,0.15022862320680555,15.42871548830605,0.19378034501287761,15.428699999999999,0.14269999999999999,15.428699999999999,0.15720000000000001,15.428699999999999,0.20080000000000001,1.5,15.399699999999999,0.1028,15.4,0.1028,15.3996,0.11749999999999999,1.5,15.399699999999999,0.1028,15.399699999999999,0.1028,15.3996,0.11749999999999999,1.5,null,null,null,null,null,null,1.5,null,null,1.5,null,null,null,null,null,null,1.5,null,null,1.5,null,null,null,null,null,null,1.5,null,null,1.5,null,null,null,null,null,null,1.5,null,null,1.5,null,null,null,null,null,null,1.5,null,null,1.5,null,null,null,null,null,null,1.5,null,null,1.5,null,null,null,null,null,null,null,null,null,null,1.5,null,null,null,null,null,null,null,null,null,null,1.5,null,null,null,null,null,null,1.5,null,null,null,null,null,null,1.5,null,null,1.5,null,null,1.5,null,null,1.5,null,null,null,null,null,null,null,null,null,null,1.5,null,null,null,null,null,null,1.5,15.91345789691019,9.963597794551135E-2,15.913459363839863,0.10606234756579784,15.913459363839863,0.10606234756579784]
[5,2.5,8.8660788303688101,0.10104137847761796,8.8660754150164784,0.14459310028369002,8.8660852019444132,0.10104137847761796,8.8660811110579356,0.11556255617235936,8.8660759701254399,0.15911427797843142,2.5,9.5480830205107523,0.10062547639665564,9.5480797155938344,0.1441771982027277,9.5480891943162547,0.10062547639665564,9.5480852307304787,0.11514665409139706,9.5480802529591458,0.15869837589746907,2.5,null,null,null,null,null,null,null,null,null,null,2.5,null,null,null,null,null,null,null,null,null,null,2.5,8.8660800000000002,0.10174,8.8660800000000002,0.10174,8.8660800000000002,0.11444,8.8660800000000002,0.11444,2.5,null,null,null,null,2.5,9.5480862430300846,9.696280068862613E-2,9.5480903617873452,9.696280068862613E-2,9.5480903617873452,9.696280068862613E-2,9.5480903617873452,9.696280068862613E-2,2.5,8.8660744309096611,0.20736966266804702,8.8660748939415353,0.16381794086197496,8.866075734029689,0.16381794086197496,8.8660751937271254,0.17833911855671636,8.8660745055777603,0.22189084036278839,null,null,null,null,null,null,2.5,null,null,null,null,null,null,null,null,null,null,null,null,null,null,null,null,2.5,null,null,null,null,null,null,2.5,9.4485011163269021,0.14029944827926177,9.4485000576355489,0.18385117008533383,9.4484999999999992,0.13200000000000001,9.4484999999999992,0.14660000000000001,9.4484999999999992,0.19009999999999999,2.5,9.4495000000000005,9.4100000000000003E-2,9.4499999999999993,9.4100000000000003E-2,9.4504000000000001,0.10879999999999999,2.5,9.4495000000000005,9.4100000000000003E-2,9.4495000000000005,9.4100000000000003E-2,9.4504000000000001,0.10879999999999999,2.5,null,null,null,null,null,null,2.5,null,null,2.5,null,null,null,null,null,null,2.5,null,null,2.5,null,null,null,null,null,null,2.5,null,null,2.5,null,null,null,null,null,null,2.5,null,null,2.5,null,null,null,null,null,null,2.5,null,null,2.5,null,null,null,null,null,null,2.5,null,null,2.5,null,null,null,null,null,null,null,null,null,null,2.5,null,null,null,null,null,null,null,null,null,null,2.5,null,null,null,null,null,null,2.5,null,null,null,null,null,null,2.5,null,null,2.5,null,null,2.5,null,null,2.5,null,null,null,null,null,null,null,null,null,null,2.5,null,null,null,null,null,null,2.5,9.5480837640567078,9.5727008277779996E-2,9.5480865537541142,9.963597794551135E-2,9.5480865537541142,9.963597794551135E-2]
[6,4,5.5158888236986936,9.4854842762555777E-2,5.5158821391015831,0.13840656456862782,5.5159013803830401,9.4854842762555777E-2,5.5158933216379165,0.10937602045729718,5.5158832276847543,0.15292774226336922,4,5.9226974907097469,9.416692332599641E-2,5.9226910377199307,0.13771864513206844,5.9227096293865511,9.416692332599641E-2,5.9227018395790179,0.10868810102073781,5.9226920890139789,0.15223982282680984,4,null,null,null,null,null,null,null,null,null,null,4,null,null,null,null,null,null,null,null,null,null,4,5.5158899999999997,9.5409999999999995E-2,5.5158899999999997,9.5409999999999995E-2,5.5158899999999997,0.10811,5.5158899999999997,0.10811,4,null,null,null,null,4,null,null,null,null,null,null,null,null,4,5.5158802682715633,0.19590336570594896,5.5158813403786136,0.1523516438998769,5.5158832892939635,0.1523516438998769,5.5158820359924343,0.1668728215946183,5.5158804412456206,0.21042454340069036,null,null,null,null,null,null,4,5.9226896026615448,0.17227907575605972,5.9226917504762024,0.12872735394998766,5.9226932366777838,0.12872735394998766,5.9226916186986704,0.14324853164472903,5.9226895671705142,0.18680025345080106,5.92,9.3729999999999994E-2,5.92,9.3729999999999994E-2,5.92,0.10836999999999999,4,null,null,null,null,null,null,4,5.8782281604962501,0.12980609520567005,5.8782257839477872,0.1733578170117421,5.8781999999999996,0.12180000000000001,5.8781999999999996,0.1363,5.9782000000000002,0.1799,4,5.8803000000000001,8.7599999999999997E-2,5.88,8.7599999999999997E-2,5.8800999999999997,0.1022,4,5.8803000000000001,8.7599999999999997E-2,5.8803000000000001,8.7599999999999997E-2,5.8800999999999997,0.1022,4,null,null,null,null,null,null,4,null,null,4,null,null,null,null,null,null,4,null,null,4,null,null,null,null,null,null,4,null,null,4,null,null,null,null,null,null,4,null,null,4,null,null,null,null,null,null,4,null,null,4,null,null,null,null,null,null,4,null,null,4,null,null,null,null,null,null,null,null,null,null,4,null,null,null,null,null,null,null,null,null,null,4,null,null,null,null,null,null,4,null,null,null,null,null,null,4,null,null,4,null,null,4,null,null,4,null,null,null,null,null,null,null,null,null,null,4,null,null,null,null,null,null,4,5.9226974907097469,9.4606746297498989E-2,5.9227021620814559,9.5727008277779996E-2,5.9227021620814559,9.5727008277779996E-2]
[7,6,3.6852596542480334,9.1084245931985622E-2,3.6852466519734604,0.13463596773805767,3.6852843589703728,9.1084245931985622E-2,3.6852685144248674,0.10560542362672701,3.6852487762614459,0.14915714543279904,6,3.9484867402035873,8.7592539849106102E-2,3.9484748075780072,0.13114426165517815,3.9485093939700713,8.7592539849106102E-2,3.9484948641398723,0.1021137175438475,3.9484767566659609,0.14566543934991955,6,null,null,null,null,null,null,null,null,null,null,6,null,null,null,null,null,null,null,null,null,null,6,3.68527,8.7620000000000003E-2,3.68527,8.7620000000000003E-2,3.68526,0.10032000000000001,3.68526,0.10032000000000001,6,null,null,null,null,6,null,null,null,null,null,null,null,null,6,3.6852431821200011,0.18529160553473545,3.6852457748341974,0.14173988372866339,3.6852505063302701,0.14173988372866339,3.6852474643181634,0.15626106142340479,3.6852436008628566,0.19981278322947682,null,null,null,null,null,null,6,3.9484723407061151,0.16155835833968357,3.9484768727160202,0.11800663653361151,3.9484852173576721,0.11800663653361151,3.9484798553309877,0.13252781422835291,3.9484730745488874,0.17607953603442497,3.95,8.7150000000000005E-2,3.95,8.7150000000000005E-2,3.95,0.10181999999999999,6,null,null,null,null,null,null,6,3.927335004720113,0.12209340787420903,3.9273304578076624,0.16564512968028106,3.9272999999999998,0.1144,3.9272999999999998,0.12889999999999999,3.9272999999999998,0.1724,6,3.9300999999999999,8.3699999999999997E-2,3.93,8.3699999999999997E-2,3.9298000000000002,9.8299999999999998E-2,6,3.9300999999999999,8.3699999999999997E-2,3.9300999999999999,8.3699999999999997E-2,3.9298000000000002,9.8299999999999998E-2,6,null,null,null,null,null,null,6,null,null,6,null,null,null,null,null,null,6,null,null,6,null,null,null,null,null,null,6,null,null,6,null,null,null,null,null,null,6,null,null,6,null,null,null,null,null,null,6,null,null,6,null,null,null,null,null,null,6,null,null,6,null,null,null,null,null,null,null,null,null,null,6,null,null,null,null,null,null,null,null,null,null,6,null,null,null,null,null,null,6,null,null,null,null,null,null,6,null,null,6,null,null,6,null,null,6,null,null,null,null,null,null,null,null,null,null,6,null,null,null,null,null,null,6,3.9484867402035873,8.8032362820608681E-2,3.9484955111740714,9.4606746297498989E-2,3.9484955111740714,9.4606746297498989E-2]
[8,10,2.1896630488985349,8.9705633464137916E-2,2.1896401837271044,0.13325735527020996,2.1897065863815515,8.9705633464137916E-2,2.1896786660657588,0.1042268111588793,2.1896439212009509,0.14777853296495136,10,2.2853815551975094,8.4258362523661118E-2,2.2853586303740099,0.12781008432973318,2.2854253110310867,8.4258362523661118E-2,2.2853972547780605,9.8779540218402503E-2,2.2853623802654051,0.14233126202447455,10,null,null,null,null,null,null,null,null,null,null,10,null,null,null,null,null,null,null,null,null,null,10,2.1896800000000001,8.6019999999999999E-2,2.1896800000000001,8.6019999999999999E-2,2.1896599999999999,9.8720000000000002E-2,2.1896599999999999,9.8720000000000002E-2,10,null,null,null,null,10,null,null,null,null,null,null,null,null,10,2.1896346503720907,0.17392901960995499,2.1896409154784813,0.13037729780388294,2.1896523989275387,0.13037729780388294,2.1896450176423232,0.14489847549862434,2.1896356632994309,0.18845019730469639,null,null,null,null,null,null,10,2.2853538056343705,0.15916262396344549,2.2853622562389515,0.11561090215737345,2.2853778384102736,0.11561090215737345,2.2853678263754986,0.13013207985211483,2.2853551744001113,0.17368380165818689,2.29,8.4739999999999996E-2,2.29,8.4750000000000006E-2,2.29,9.9349999999999994E-2,10,null,null,null,null,null,null,10,2.3334809390235933,0.11523651299350877,2.3334714197476476,0.15878823479958085,2.3334999999999999,0.1085,2.3334999999999999,0.123,2.3334999999999999,0.1666,10,2.3296000000000001,8.0600000000000005E-2,2.33,8.0600000000000005E-2,2.3300999999999998,9.5299999999999996E-2,10,2.3296000000000001,8.0600000000000005E-2,2.3296000000000001,8.0600000000000005E-2,2.3300999999999998,9.5299999999999996E-2,10,2.3334818266639692,0.14021198222725256,2.3334767807327443,0.15473315992199391,2.3334703738150924,0.19828488172806599,10,2.33,0.10692,10,2.3334999999999999,0.14199999999999999,2.3334999999999999,0.1565,2.3334999999999999,0.2,10,2.3334999999999999,0.1242,10,null,null,null,null,null,null,10,null,null,10,null,null,null,null,null,null,10,null,null,10,null,null,null,null,null,null,10,null,null,10,null,null,null,null,null,null,10,null,null,10,3.7006460525880565,0.13840930542026433,3.7006575353289755,9.4857583614192276E-2,3.70067923098423,9.4857583614192276E-2,3.7006653116792365,0.10937876130893366,3.7006479255927007,0.15293048311500571,10,3.7006458205585879,0.14037392008254193,3.7006566072111018,9.6822198276469887E-2,3.7006769332672222,9.6822198276469887E-2,3.7006638905717488,0.11134337597121127,3.7006475786704081,0.1548950977772833,10,null,null,null,null,null,null,10,null,null,null,null,null,null,10,null,null,10,null,null,10,null,null,10,3.9488962319045497,0.11564137688821077,3.948890678849569,0.15919309869428283,3.9489000000000001,0.11559999999999999,3.9489000000000001,0.13020000000000001,3.9489000000000001,0.17369999999999999,10,3.948907172971726,8.7136625410646137E-2,3.9489174107045781,8.7136625410646137E-2,3.9489174107045781,8.7136625410646137E-2,10]
[9,16,1.3760899847877317,8.5641374848888077E-2,1.376048574688632,0.12919309665496009,1.3761693802064894,8.5641374848888077E-2,1.3761184818643311,0.10016255254362948,1.3760553549280732,0.14371427434970152,16,1.4478747875959934,8.1319707522029494E-2,1.4478350526334791,0.12487142932810154,1.4479510160226499,8.1319707522029494E-2,1.4479021501684566,9.5840885216770894E-2,1.4478415600342509,0.13939260702284292,16,null,null,null,null,null,null,null,null,null,null,16,null,null,null,null,null,null,null,null,null,null,16,1.37612,8.0930000000000002E-2,1.37612,8.0930000000000002E-2,1.37609,9.3630000000000005E-2,1.37609,9.3630000000000005E-2,16,null,null,null,null,16,null,null,null,null,null,null,null,null,16,1.376039243810302,0.16459782925759203,1.3760526612744115,0.12104610745151997,1.3760773743928787,0.12104610745151997,1.3760614929585813,0.13556728514626137,1.3760414152647225,0.17911900695233343,null,null,null,null,null,null,16,1.4478273613927506,0.15217646829351492,1.4478440226330791,0.10862474648744284,1.4478748964664931,0.10862474648744284,1.4478550638848013,0.12314592418218427,1.4478300631736947,0.16669764598825632,1.452,8.0879999999999994E-2,1.45,8.0879999999999994E-2,1.45,9.5560000000000006E-2,16,null,null,null,null,null,null,16,1.466447111827301,0.10727246844819055,1.4664275932952573,0.15082419025426258,1.4664999999999999,0.1008,1.4664999999999999,0.1153,1.4663999999999999,0.15890000000000001,16,1.47,7.6700000000000004E-2,1.47,7.6700000000000004E-2,1.4702,9.1300000000000006E-2,16,1.47,7.6700000000000004E-2,1.47,7.6700000000000004E-2,1.4702,9.1300000000000006E-2,16,1.4664510500356267,0.13001634238237433,1.4664399001150723,0.14453752007711568,1.4664257709207751,0.18808924188318779,16,1.47,9.9379999999999996E-2,16,1.4663999999999999,0.1326,1.4663999999999999,0.14710000000000001,1.4663999999999999,0.19070000000000001,16,1.4663999999999999,0.1149,16,1.4664366387074612,0.15048908624355758,1.4664308663393952,0.16501026393829898,1.4664235264067753,0.20856198574437101,16,1.47037,0.12881000000000001,16,null,null,null,null,null,null,16,null,null,16,null,null,null,null,null,null,16,null,null,16,null,null,null,null,null,null,16,null,null,16,2.294908152242717,0.13308015982299426,2.2949300919590412,8.9528438016922229E-2,2.2949718798855105,8.9528438016922229E-2,2.294945082134344,0.1040496157116636,2.2949117388243154,0.14760133751773563,16,2.2949078949712098,0.1342052444736466,2.2949290628730132,9.0653522667574538E-2,2.2949693073414794,9.0653522667574538E-2,2.2949434965846409,0.10517470036231594,2.2949113535568273,0.148726422168388,16,null,null,null,null,null,null,16,null,null,null,null,null,null,16,null,null,16,null,null,16,null,null,16,2.4488601037420565,0.10740629566187597,2.4488484654461322,0.15095801746794804,2.4489000000000001,0.1074,2.4489000000000001,0.12189999999999999,2.4487999999999999,0.16550000000000001,16,2.4488791324096506,8.2263497825718235E-2,2.4488987063725887,8.2263497825718235E-2,2.4488987063725887,8.2263497825718235E-2,16]
[10,25,0.87003549540361791,8.6326727918200299E-2,0.86997140679355489,0.12987844972427234,0.87015816420501269,8.6326727918200299E-2,0.87007950358550001,0.1008479056129417,0.86998188694701295,0.14439962741901374,25,0.93344261440466814,8.0449205193157666E-2,0.93337924419444718,0.12400092699922974,0.933564340861751,8.0449205193157666E-2,0.93348630381709563,9.4970382887899066E-2,0.93338961946183374,0.13852210469397114,25,null,null,null,null,null,null,null,null,null,null,25,null,null,null,null,null,null,null,null,null,null,25,0.87009000000000003,8.0479999999999996E-2,0.87009000000000003,8.0479999999999996E-2,0.87004000000000004,9.3179999999999999E-2,0.87004000000000004,9.3179999999999999E-2,25,null,null,null,null,25,null,null,null,null,null,null,null,null,25,0.86995913880466968,0.15670584854923986,0.86998642344807653,0.1131541267431678,0.87003693631199763,0.1131541267431678,0.87000447951405735,0.12767530443790917,0.86996355696694083,0.17122702624398126,null,null,null,null,null,null,25,0.93336700835887232,0.15119857941812728,0.93339367106236937,0.10764685761205524,0.93344309929875724,0.10764685761205524,0.93341134436965889,0.12216803530679662,0.93337133005800998,0.16571975711286865,0.93689999999999996,8.0009999999999998E-2,0.9335,8.0009999999999998E-2,0.9335,9.4689999999999996E-2,25,null,null,null,null,null,null,25,0.92713293854279266,0.10343002271793005,0.92709804734633894,0.14698174452400209,0.92720000000000002,9.6699999999999994E-2,0.92720000000000002,0.11119999999999999,0.92710000000000004,0.1547,25,0.92720000000000002,7.6799999999999993E-2,0.92720000000000002,7.6799999999999993E-2,0.92720000000000002,9.1499999999999998E-2,25,0.92720000000000002,7.6799999999999993E-2,0.92720000000000002,7.6799999999999993E-2,0.92720000000000002,9.1499999999999998E-2,25,0.92714957028771861,0.12107964012907199,0.92712602798935018,0.13560081782381336,0.92709626500026432,0.17915253962988545,25,0.92720000000000002,9.2999999999999999E-2,25,0.92710000000000004,0.1258,0.92710000000000004,0.14030000000000001,9.7100000000000006E-2,0.18379999999999999,25,0.92710000000000004,0.1103,25,0.9271200158430849,0.14073798784999003,0.92710753173911797,0.15525916554473143,0.92709167908550549,0.19881088735080346,25,0.92708999999999997,0.11969,25,null,null,null,null,null,null,25,null,null,25,0.92711343773542731,0.14754526267860832,0.92710340515743894,0.16206644037334975,0.92709065281593062,0.20561816217942178,25,0.92712745260675489,0.13449889661894063,25,null,null,null,null,null,null,25,null,null,25,1.4418694212399097,0.13114769440254734,1.4419065569942462,8.759597259647528E-2,1.4419775091667402,8.759597259647528E-2,1.4419320146167267,0.10211715029121669,1.4418754957259967,0.14566887209728874,25,1.441868940309277,0.13239260375819753,1.4419046332717134,8.8840881952125486E-2,1.4419726834425137,8.8840881952125486E-2,1.4419290441287738,0.10336205964686689,1.4418747751683991,0.1469137814529389,25,null,null,null,null,null,null,25,null,null,null,null,null,null,25,null,null,25,null,null,25,null,null,25,1.5386014881672445,0.10343002271793005,1.5385804646716625,0.14698174452400209,1.5386,0.10340000000000001,1.5386,0.11799999999999999,1.5386,0.1615,25,1.538627421525024,8.2852366738413688E-2,1.5386579340736375,8.2852366738413688E-2,1.5386579340736375,8.2852366738413688E-2,25]
[11,35,0.62722888328756488,8.0251817132148448E-2,0.6271300909153128,0.12380353893822052,0.62741904803656956,8.0251817132148448E-2,0.62729711637715624,9.4772994826889848E-2,0.62714625384602896,0.13832471663296189,35,0.66311615993118955,7.7395455939092972E-2,0.66301783481667165,0.12094717774516504,0.6633060761629066,7.7395455939092972E-2,0.66318433536149668,9.1916633633834371E-2,0.66303394183772646,0.13546835543990643,35,null,null,null,null,null,null,null,null,null,null,35,null,null,null,null,null,null,null,null,null,null,35,0.62731000000000003,7.7340000000000006E-2,0.62731000000000003,7.7340000000000006E-2,0.62724000000000002,9.0039999999999995E-2,0.62724000000000002,9.0039999999999995E-2,35,null,null,null,null,35,null,null,null,null,null,null,null,null,35,0.62711237561573052,0.14805958871910357,0.62715802208923532,0.10450786691303153,0.62724290589250487,0.10450786691303153,0.62718836440797343,0.11902904460777293,0.62711976681630055,0.16258076641384497,null,null,null,null,null,null,35,0.66300017096436592,0.14527039145876292,0.66304550452196642,0.10171866965269087,0.66312995138484676,0.10171866965269087,0.66307570255166681,0.11623984734743226,0.66300752206478741,0.15979156915350431,0.66769999999999996,7.6960000000000001E-2,0.66320000000000001,7.6960000000000001E-2,0.66310000000000002,9.1300000000000006E-2,35,null,null,null,null,null,null,35,0.66834961371577639,9.9075871731611503E-2,0.66829401161688495,0.14262759353768356,0.66839999999999999,9.2499999999999999E-2,0.66839999999999999,0.107,0.66830000000000001,0.15060000000000001,35,0.62319999999999998,7.4800000000000005E-2,0.66849999999999998,7.4800000000000005E-2,0.66839999999999999,8.9499999999999996E-2,35,0.66849999999999998,7.4700000000000003E-2,0.66849999999999998,7.4800000000000005E-2,0.66839999999999999,8.9499999999999996E-2,35,0.66838228231396579,0.11492362083164533,0.66834240646351128,0.12944479852638674,0.66829209670657952,0.17299652033245877,35,0.66839999999999999,8.9200000000000002E-2,35,0.66830000000000001,0.11940000000000001,0.66830000000000001,0.13389999999999999,0.66830000000000001,0.17749999999999999,35,0.66839999999999999,0.105,35,0.66833368612484056,0.13379456907170653,0.66831203699160247,0.14831574676644793,0.66828458104020294,0.19186746857251999,35,0.66827000000000003,0.11373,35,0.66830000000000001,9.2499999999999999E-2,0.66830000000000001,0.1545,0.66830000000000001,0.19800000000000001,35,0.66849999999999998,7.4800000000000005E-2,35,0.6683219817059407,0.1407986786706622,0.6683047017925039,0.15531985636540357,0.6682827591103645,0.19887157817147566,35,0.66834582249616192,0.12789490400676967,35,0.66829910240802659,0.16197771472402139,0.66829033955558648,0.17649889241876277,0.66827918419042642,0.22005061422483482,35,0.66830000000000001,0.14591000000000001,35,1.0429997363090575,0.12806420765364737,1.0430563696190407,8.4512485847575355E-2,1.0431651602117131,8.4512485847575355E-2,1.0430954196329338,9.9033663542316727E-2,1.0430090107582952,0.14258538534838877,35,1.0429988918464417,0.1295019443721375,1.0430529917685774,8.5950222566065479E-2,1.0431566359210518,8.5950222566065479E-2,1.0430901838719802,0.10047140026080686,1.0430077444276347,0.14402312206687889,35,null,null,null,null,null,null,35,null,null,null,null,null,null,35,1.1129458506351717,0.17573728487476423,35,1.1129420200630902,0.19275036628104653,35,null,null,35,1.1129812149173131,9.9075871731611503E-2,1.1129478299242426,0.14262759353768356,1.113,9.9099999999999994E-2,1.113,0.11360000000000001,1.1129,0.15709999999999999,35,1.1130167083938247,8.0655989036096595E-2,1.1130622755766471,8.0655989036096595E-2,1.1130622755766471,8.0655989036096595E-2,35]
[12,50,0.46340436974182242,7.9733781996147945E-2,0.46326839247708079,0.12328550380221999,0.46366608234539081,7.9733781996147945E-2,0.46349820109741863,9.4254959690889345E-2,0.46329059309182197,0.1378066814969614,50,0.46221867009962836,7.6815822187504185E-2,0.46207493736708383,0.12036754399357624,0.4624962688066297,7.6815822187504185E-2,0.46231823331096156,9.1336999882245556E-2,0.46209842816273422,0.13488872168831759,50,null,null,null,null,null,null,null,null,null,null,50,null,null,null,null,null,null,null,null,null,null,50,null,null,null,null,null,null,null,null,50,null,null,null,null,50,null,null,null,null,null,null,null,null,50,0.46324704067517924,0.14329454184602497,0.46331896253421617,9.9742820039952898E-2,0.46345320590100375,9.9742820039952898E-2,0.46336692881048763,0.11426399773469428,0.46325867316445374,0.15781571954076631,0.46350000000000002,7.8560000000000005E-2,0.46350000000000002,7.8560000000000005E-2,0.46339999999999998,9.3210000000000001E-2,50,null,null,null,null,null,null,null,null,null,null,null,null,null,null,null,null,50,0.46348832804085377,8.1794027326012334E-2,0.46363696432350127,8.1794027326012334E-2,0.46363696432350127,8.1794027326012334E-2,50,0.49374276598323946,9.2745018807204802E-2,0.49365843691253308,0.13629674061327685,0.49380000000000002,8.9200000000000002E-2,0.49380000000000002,0.1037,0.49370000000000003,0.14729999999999999,50,0.49390000000000001,7.3599999999999999E-2,0.49390000000000001,7.3599999999999999E-2,0.49390000000000001,8.8200000000000001E-2,50,0.49390000000000001,7.3599999999999999E-2,0.49390000000000001,7.3599999999999999E-2,0.49390000000000001,8.8819999999999996E-2,50,0.4938023500366111,0.10676554163729797,0.49373802097546338,0.12128671933203938,0.49365703286835583,0.16483844113811141,50,0.49380000000000002,8.5199999999999998E-2,50,0.49370000000000003,0.1137,0.49370000000000003,0.12820000000000001,0.49370000000000003,0.17180000000000001,50,0.49380000000000002,9.9699999999999997E-2,50,0.49372696551878487,0.12465606747900047,0.49369098369117492,0.13917724517374186,0.49364541587467847,0.18272896697981389,50,0.49367,0.10775999999999999,50,0.49359999999999998,8.9200000000000002E-2,0.49370000000000003,0.14699999999999999,0.49359999999999998,0.19059999999999999,50,0.49390000000000001,7.3599999999999999E-2,50,0.49370980442110468,0.13074559855542214,0.4936802417343592,0.14526677625016352,0.49364275192517343,0.18881849805623555,50,0.49374801694778075,0.11852838974312473,50,0.4936765406103662,0.14767529484179029,0.49365938350363048,0.16219647253653172,0.49363756737228126,0.20574819434260375,50,0.49370000000000003,0.13414000000000001,50,0.77029364139229595,0.12554695840394878,0.77036972659814518,8.1995236597876733E-2,0.77051575302690567,8.1995236597876733E-2,0.77042212253259612,9.6516414292618133E-2,0.77030608881484897,0.14006813609869018,50,0.77029190471578157,0.1305400044629679,0.77036277989208779,8.6988282656895843E-2,0.7704982499912707,8.6988282656895843E-2,0.77041136684194811,0.10150946035163723,0.77030348577622754,0.14506118215770927,50,null,null,null,null,null,null,50,null,null,null,null,null,null,50,0.82194013690387924,0.17196536438838522,50,0.82193452604797113,0.18806890183761957,50,0.82193291233628174,0.19479807615516051,50,0.82199155456994133,9.6518906361400134E-2,0.82194251482269232,0.14007062816747221,0.82199999999999995,9.6500000000000002E-2,0.82199999999999995,0.111,0.82189999999999996,0.15459999999999999,50,0.82203634444757534,8.0127088788607331E-2,0.82209918996329001,8.0127088788607331E-2,0.82209918996329001,8.0127088788607331E-2,50]
[13,70,0.32120440172273423,7.6942129943660106E-2,0.32098984516306345,0.12049385174973215,0.32161867586167542,7.6942129943660106E-2,0.32135270988348408,9.1463307638401492E-2,0.32102474123982111,0.13501502944447355,70,0.32599462000152662,7.4355771743542076E-2,0.32577407614089632,0.11790749354961411,0.32642180643390201,7.4355771743542076E-2,0.32614761979534046,8.8876949438283476E-2,0.32580999088250812,0.13242867124435551,70,null,null,null,null,null,null,null,null,null,null,70,null,null,null,null,null,null,null,null,null,null,70,null,null,null,null,null,null,null,null,70,null,null,null,null,70,null,null,null,null,null,null,null,null,70,0.32095899653113008,0.13822704069135719,0.32108100719500099,9.4675318885285159E-2,0.32130948258659819,9.4675318885285159E-2,0.32116251417453301,0.10919649658002654,0.32097864720548863,0.15274821838609862,0.32140000000000002,7.5700000000000003E-2,0.32140000000000002,7.5700000000000003E-2,0.32129999999999997,3.0349999999999999E-2,70,null,null,null,null,null,null,null,null,null,null,null,null,null,null,null,null,70,0.32134035297067909,7.8737447882830727E-2,0.32157825668101631,7.8737447882830727E-2,0.32157825668101631,7.8737447882830727E-2,70,0.34214817461507535,8.9355207992620755E-2,0.34201255177817808,0.13290692979869281,0.34229999999999999,8.5999999999999993E-2,0.34229999999999999,0.10050000000000001,0.34200000000000003,0.14410000000000001,70,0.34239999999999998,7.2599999999999998E-2,0.34239999999999998,7.2499999999999995E-2,0.34229999999999999,8.72E-2,70,0.34239999999999998,7.2499999999999995E-2,0.34239999999999998,7.2499999999999995E-2,0.34229999999999999,8.72E-2,70,0.34225157265134881,0.10255438771433147,0.34214512358481347,0.11707556540907288,0.34201136847930141,0.16062728721514488,70,0.34229999999999999,8.1699999999999995E-2,70,0.34210000000000002,0.1074,0.34210000000000002,0.122,0.34200000000000003,0.16550000000000001,70,0.3422,9.4600000000000004E-2,70,0.34214127925032883,0.11775427087828198,0.34207641960516061,0.1322754485730234,0.34199443748597136,0.17582717037909543,70,0.34211999999999998,0.10179000000000001,70,0.34229999999999999,8.5999999999999993E-2,0.34210000000000002,0.13950000000000001,0.34200000000000003,0.18310000000000001,70,0.34239999999999998,7.2499999999999995E-2,70,0.3421099300430841,0.12393132892836081,0.34205682630462853,0.13845250662310221,0.34198958797840018,0.18200422842917424,70,0.34217639382520815,0.11205070786757988,70,0.34205391216126785,0.13948611308102232,0.34202174125595242,0.15400729077576372,0.34198088040220714,0.19755901258183578,70,0.34200000000000003,0.12655,70,0.53245950155689459,0.12243510126235103,0.53258104714240906,7.8883379456278976E-2,0.53281553981676266,7.8883379456278976E-2,0.53266517561259141,9.3404557151020362E-2,0.53247938167123199,0.13695627895709239,70,0.53245735415564122,0.12414597132612097,0.53257245753739546,8.0594249520048913E-2,0.53279374832514625,8.0594249520048913E-2,0.53265181993722643,9.5115427214790313E-2,0.5324761609398867,0.13866714902086236,70,null,null,null,null,null,null,70,null,null,null,null,null,null,70,0.568139924440627,0.1627097846379699,70,0.56813054514186334,0.177562529609123,70,0.56812773407140249,0.18661556030725154,70,0.56822235354444972,8.9805617470287633E-2,0.56814189731812426,0.13335733927635968,0.56830000000000003,8.9800000000000005E-2,0.56820000000000004,0.1043,0.56810000000000005,0.1479,70,0.56828324125374596,7.5683011996989125E-2,0.56837967220861241,7.5683011996989125E-2,0.56837967220861241,7.5683011996989125E-2,70]
[14,95,0.23167490783016667,7.7133355117120689E-2,0.23137889482777602,0.12068507692319273,0.2322434322114722,7.7133355117120689E-2,0.23187765205218003,9.1654532811862088E-2,0.2314265507748611,0.13520625461793415,95,0.24719479883983167,7.4819158374120953E-2,0.24690794379381673,0.118370880180193,0.24774773629757707,7.4819158374120953E-2,0.24739223051869294,8.9340336068862325E-2,0.24695427941612386,0.13289205787493441,95,null,null,null,null,null,null,null,null,null,null,95,null,null,null,null,null,null,null,null,null,null,95,null,null,null,null,null,null,null,null,95,null,null,null,null,95,null,null,null,null,null,null,null,null,95,0.23134200132297716,0.13539564534378118,0.23152733381097126,9.1843923537709149E-2,0.23187396670655938,9.1843923537709149E-2,0.23165054954823674,0.10636510123245056,0.23137156750747886,0.14991682303852261,0.2319,7.5050000000000006E-2,0.2319,7.5050000000000006E-2,0.23180000000000001,8.9700000000000002E-2,95,null,null,null,null,null,null,null,null,null,null,null,null,null,null,null,null,95,0.23188168147663996,7.7899606724321918E-2,0.23221928874084757,7.7899606724321918E-2,0.23221928874084757,7.7899606724321918E-2,95,0.2466974127229121,8.7150355342143632E-2,0.24649546221324536,0.13070207714821566,0.24690000000000001,8.3599999999999994E-2,0.24690000000000001,9.8199999999999996E-2,0.2465,0.14169999999999999,95,0.24560000000000001,7.2499999999999995E-2,0.24709999999999999,7.0599999999999996E-2,0.247,8.5300000000000001E-2,95,0.2462,7.0599999999999996E-2,0.2462,7.0599999999999996E-2,0.247,8.5300000000000001E-2,95,0.24688964991647955,9.7646673044743032E-2,0.2467164560973549,0.11216785073948443,0.24649940559741162,0.15571957254555649,95,0.24690000000000001,7.8700000000000006E-2,95,0.2467,0.10249999999999999,0.2467,0.1171,0.2465,0.16059999999999999,95,0.24679999999999999,9.0300000000000005E-2,95,0.2467166346902889,0.11214866836929369,0.24660889287072066,0.12666984606403509,0.24647296658974285,0.17022156787010709,95,0.24673999999999999,9.6759999999999999E-2,95,0.24690000000000001,8.3599999999999994E-2,0.24660000000000001,0.1333,0.2465,0.17680000000000001,95,0.24709999999999999,7.0599999999999996E-2,95,0.24667141242242097,0.11743563432039009,0.24658067486691637,0.13195681201513151,0.24646599718170167,0.17550853382120352,95,0.2467758201029398,0.10637561790384036,95,0.24657822155824266,0.13246218812456781,0.24652238605040327,0.14698336581930918,0.24645155593160289,0.19053508762538124,95,0.24661,0.11978999999999999,95,0.38475100759614872,0.12182185707671302,0.3849225657206074,7.8270135270640986E-2,0.38525339107605944,7.8270135270640986E-2,0.38504110984431916,9.2791312965382358E-2,0.38477897752656393,0.13634303477145443,95,0.38474891067901401,0.12299547824836077,0.38491417805206873,7.944375644228871E-2,0.3852320890557458,7.944375644228871E-2,0.38502806396530614,9.3964934137030109E-2,0.3847758347189259,0.13751665594310217,95,null,null,null,null,null,null,95,null,null,null,null,null,null,95,0.410512686989283,0.15771208348304636,95,0.41049829023829854,0.17155368302259061,95,0.41049382853328498,0.17747700868896568,95,0.41063206179995704,8.7525024628086145E-2,0.41051230824185353,0.1310767464341582,0.41070000000000001,8.7499999999999994E-2,0.41060000000000002,0.10199999999999999,0.41049999999999998,0.14560000000000001,95,0.41072259543203432,7.3414161231643293E-2,0.41086712577713358,7.3414161231643293E-2,0.41086712577713358,7.3414161231643293E-2,95]
[15,120,0.18403192401401844,7.4994403136944179E-2,0.18364265361898899,0.11854612494301624,0.18477733976338129,7.4994403136944179E-2,0.18429659702866372,8.9515580831685565E-2,0.18370461496456131,0.13306730263775762,120,0.19357982739163704,7.3072274075948365E-2,0.19319197972278757,0.1166239958820204,0.19432630068475321,7.3072274075948365E-2,0.19384531572449543,8.7593451770689751E-2,0.19325398808611621,0.13114517357676181,120,null,null,null,null,null,null,null,null,null,null,120,null,null,null,null,null,null,null,null,null,null,120,null,null,null,null,null,null,null,null,120,null,null,null,null,120,null,null,null,null,null,null,null,null,120,0.18359743743610799,0.13200564535805115,0.18385105928249451,8.8453923551979077E-2,0.18432430766885771,8.8453923551979077E-2,0.18401853089381409,0.10297510124672048,0.18363742477030109,0.14652682305279255,0.18429999999999999,7.3760000000000006E-2,0.18429999999999999,7.3760000000000006E-2,0.1842,8.8419999999999999E-2,120,null,null,null,null,null,null,null,null,null,null,null,null,null,null,null,null,120,0.1843053718730833,7.5688684820687094E-2,0.18474853598192534,7.5688684820687094E-2,0.18474853598192534,7.5688684820687094E-2,120,0.19587124307616749,8.448622582129231E-2,0.19560117715325712,0.12803794762736437,0.1961,8.2000000000000003E-2,0.1961,9.6500000000000002E-2,0.19570000000000001,0.14000000000000001,120,0.1963,7.0599999999999996E-2,0.19639999999999999,7.0199999999999999E-2,0.19620000000000001,8.4900000000000003E-2,120,0.19639999999999999,7.0199999999999999E-2,0.19639999999999999,7.0199999999999999E-2,0.19620000000000001,8.4900000000000003E-2,120,0.19614460855840807,9.4125273803041518E-2,0.19590657105623674,0.10864645149778293,0.19560875058891913,0.15219817330385496,120,0.19620000000000001,7.6700000000000004E-2,120,0.19589999999999999,9.8900000000000002E-2,0.19589999999999999,0.1134,0.1956,0.15690000000000001,120,0.19600000000000001,8.7400000000000005E-2,120,0.19592565256883535,0.10718909073160957,0.19577064100064503,0.12171026842635094,0.19557540188933992,0.16526199023242297,120,0.19585,9.3619999999999995E-2,120,0.1961,8.2000000000000003E-2,0.19570000000000001,0.12909999999999999,0.1956,0.17269999999999999,120,0.19639999999999999,7.0199999999999999E-2,120,0.19585896181434909,0.11261836044255022,0.19572908120907573,0.12713953813729162,0.19556515473194777,0.17069125994336365,120,0.19600563083059677,0.10174262218436805,120,0.19573320835876676,0.12655560711324046,0.19565050893215916,0.14107678480798186,0.19554571508830382,0.18462850661405389,120,0.19570000000000001,0.11518,120,0.30432654621191757,0.11916822758025539,0.30455656258467112,7.5616505774183343E-2,0.30500093004330575,7.5616505774183343E-2,0.30471559075084825,9.0137683468924729E-2,0.30436392444175497,0.13368940527499681,120,0.30432355592362037,0.121234826730407,0.30454460143148243,7.7683104924334959E-2,0.30497045591347982,7.7683104924334959E-2,0.30469695716913564,9.2204282619076358E-2,0.30435944522159492,0.1357560044251484,120,null,null,null,null,null,null,120,null,null,null,null,null,null,120,0.32468196447081732,0.15401722074071081,120,0.3246633160002434,0.16634709844240303,120,0.32465607072708641,0.17285275116856785,120,0.32483870057500547,8.5700239335990275E-2,0.32467819925364205,0.12925196114206233,0.32500000000000001,8.5699999999999998E-2,0.32479999999999998,0.1002,0.32469999999999999,0.14380000000000001,120,0.32494475078071788,7.3055356131623034E-2,0.32512956024112527,7.3055356131623034E-2,0.32512956024112527,7.3055356131623034E-2,120]
[16,150,0.14956195871910247,7.4834405006890481E-2,0.14907951318648824,0.11838612681296252,0.15047843492089252,7.4834405006890481E-2,0.14988522089674655,8.935558270163188E-2,0.1491549866047632,0.13290730450770391,150,0.15552651527721226,7.2993642981123236E-2,0.15504155081228388,0.11654536478719528,0.15645260375745157,7.2993642981123236E-2,0.15585379912616565,8.7514820675864635E-2,0.15511780656954,0.13106654248193667,150,null,null,null,null,null,null,null,null,null,null,150,null,null,null,null,null,null,null,null,null,null,150,null,null,null,null,null,null,null,null,150,null,null,null,null,150,null,null,null,null,null,null,null,null,150,0.14902308329383737,0.13196305428411992,0.14933623914849908,8.8411332478047888E-2,0.14991556876711132,8.8411332478047888E-2,0.14953980999569966,0.10293251017278926,0.14907154661430155,0.14648423197886135,0.14990000000000001,7.3639999999999997E-2,0.14990000000000001,7.3639999999999997E-2,0.1497,8.8279999999999997E-2,150,null,null,null,null,null,null,null,null,null,null,null,null,null,null,null,null,150,0.14990242203264273,7.5462728773674728E-2,0.15044622835685878,7.5462728773674728E-2,0.15044622835685878,7.5462728773674728E-2,150,0.15907787254526889,8.4301849366632695E-2,0.15874287804897871,0.12785357117270477,0.15939999999999999,8.1900000000000001E-2,0.15939999999999999,9.6500000000000002E-2,0.1588,0.14000000000000001,150,0.15989999999999999,7.0199999999999999E-2,0.15970000000000001,7.0699999999999999E-2,0.1595,8.5400000000000004E-2,150,0.15670000000000001,7.0699999999999999E-2,0.15670000000000001,7.0699999999999999E-2,0.15995000000000001,8.5400000000000004E-2,150,0.15947736537578208,9.1538280983813836E-2,0.15915895029889404,0.10605945867855525,0.15876126088055625,0.14961118048462729,150,0.1595,7.5200000000000003E-2,150,0.15909999999999999,9.64E-2,0.15909999999999999,0.111,0.15870000000000001,0.1545,150,0.1593,8.5199999999999998E-2,150,0.15918921728989949,0.10433769852800763,0.15898030034322616,0.118858876222749,0.15871750756133182,0.16241059802882102,150,0.15926999999999999,9.0789999999999996E-2,150,0.15939999999999999,8.1900000000000001E-2,0.15890000000000001,0.1255,0.15870000000000001,0.16900000000000001,150,0.15970000000000001,7.0699999999999999E-2,150,0.15910972637491186,0.10908587681903383,0.15893082093539423,0.12360705451377522,0.15870532612054086,0.16715877631984724,150,0.15930051065513692,9.8734000221589624E-2,150,0.15893882638428358,0.12278745554765919,0.15882414784615201,0.13730863324240053,0.15867896854021785,0.18086035504847259,150,0.15890000000000001,0.1115,150,0.24793480396837031,0.11926207651939397,0.24821639195626355,7.5710354713321909E-2,0.2487880413470181,7.4760736843060616E-2,0.24842795087183231,8.9281914537802015E-2,0.24798458968074466,0.13283363634387405,150,0.24793163333360935,0.12115844301718683,0.24820370941721964,7.7606721211114796E-2,0.24872640184828104,7.7606721211114796E-2,0.24839027877052836,9.2127898905856181E-2,0.24797553972586109,0.13567962071192824,150,null,null,null,null,null,null,150,null,null,null,null,null,null,150,0.26449930719904918,0.15169497308974389,150,0.26447469127380918,0.16401723434763354,150,0.26446666653665918,0.16937663939373665,150,0.2646879115093671,8.5530537921604838E-2,0.26448976357384574,0.12908225972767687,0.26479999999999998,8.5500000000000007E-2,0.26469999999999999,0.10009999999999999,0.26450000000000001,0.14360000000000001,150,0.26481221755338441,7.3416378567458085E-2,0.26503567994254401,7.3416378567458085E-2,0.26503567994254401,7.3416378567458085E-2,150]
[17,185,0.12006670961281105,7.4868224969887931E-2,0.1194643442541362,0.11841994677595999,0.12119527168183902,7.4868224969887931E-2,0.12046034856682081,8.938940266462933E-2,0.11955587757652489,0.13294112447070139,185,0.12824970890401968,7.3452090797626504E-2,0.12766855962854037,0.11700381260369856,0.12934633619778527,7.3452090797626504E-2,0.12863384633812353,8.797326849236789E-2,0.12775785564901004,0.13152499029843992,185,null,null,null,null,null,null,null,null,null,null,185,null,null,null,null,null,null,null,null,null,null,185,null,null,null,null,null,null,null,null,185,null,null,null,null,185,null,null,null,null,null,null,null,null,185,0.11939951540111178,0.13066883114187131,0.11980739420071339,8.7117109335799248E-2,0.12055287766214223,8.7117109335799248E-2,0.12006636345953023,0.10163828703054065,0.11946077871746261,0.14519000883661271,0.1205,7.3419999999999999E-2,0.1205,7.3419999999999999E-2,0.1203,8.09E-2,185,null,null,null,null,null,null,null,null,null,null,null,null,null,null,null,null,185,0.12049340274068258,7.5429227384946201E-2,0.12115960218674963,7.5429227384946201E-2,0.12115960218674963,7.5429227384946201E-2,185,0.12756970575692067,8.4260752667117286E-2,0.12715039025864297,0.12781247447318936,0.12790000000000001,8.1299999999999997E-2,0.12790000000000001,9.5799999999999996E-2,0.12720000000000001,0.1394,185,0.1283,7.1199999999999999E-2,0.1283,7.1199999999999999E-2,0.128,8.5900000000000004E-2,185,0.1283,7.1199999999999999E-2,0.1283,7.1199999999999999E-2,0.128,8.5900000000000004E-2,185,0.12813749063367036,8.9378966346513544E-2,0.1277128394965539,0.10390014404125492,0.12718333675852533,0.14745186584732695,185,0.1285,7.3700000000000002E-2,185,0.12759999999999999,9.3399999999999997E-2,0.12759999999999999,0.1079,0.12720000000000001,0.1515,185,0.12790000000000001,8.2900000000000001E-2,185,0.12776919968102377,0.10152082018180145,0.1274848055131938,0.11604199787654285,0.12712758731581222,0.15959371968261488,185,0.12767999999999999,8.8279999999999997E-2,185,0.12790000000000001,8.1299999999999997E-2,0.12740000000000001,0.122,0.12709999999999999,0.1656,185,0.1283,7.1199999999999999E-2,185,0.12765537834055146,0.10653460833629327,0.12741403609416144,0.12105578603103467,0.12711018997902965,0.16460750783710668,185,0.12790983939333742,9.6290526432386211E-2,185,0.12744249083869086,0.11894059973968797,0.12728128485106793,0.13346177743442939,0.12707743060812471,0.17701349924050142,185,0.12740000000000001,0.10766000000000001,185,0.19758183424026976,0.11892060164060821,0.19793925989379241,7.5368879834536162E-2,0.19866933238013579,7.4231620677390975E-2,0.19821030956054017,8.875279837213236E-2,0.19764552118956674,0.1323045201782044,185,0.19757688154093792,0.12025447468407888,0.197919449096465,7.6702752878006847E-2,0.19857433684203865,7.6702752878006847E-2,0.19815227252613427,9.1223930572748232E-2,0.19763158595201655,0.1347756523788203,185,null,null,null,null,null,null,185,null,null,null,null,null,null,185,0.21075849667406402,0.1480669772402643,185,0.21072644579216246,0.15964470071041326,185,0.21071573358158191,0.16553765339571991,185,0.21099322820932884,8.4103279268718828E-2,0.21073953995469455,0.12765500107479086,0.2112,8.4099999999999994E-2,0.21099999999999999,0.98599999999999999,0.2107,0.14219999999999999,185,0.21113221887632713,7.3288824921527537E-2,0.21140482180931458,7.3288824921527537E-2,0.21140482180931458,7.3288824921527537E-2,185]
[18,240,9.2198853079870885E-2,7.3688995136249366E-2,9.1390052445499789E-2,0.1172407169423214,9.3675809441692376E-2,7.3688995136249366E-2,9.2702358309250443E-2,8.8210172830990738E-2,9.1505957165302493E-2,0.13176189463706281,240,9.7738993545362848E-2,7.2727774766719072E-2,9.6953535558885945E-2,0.1162794965727911,9.918751838152455E-2,7.2727774766719072E-2,9.8236175361019445E-2,8.7248952461460444E-2,9.7068068118592768E-2,0.1308006742675325,240,null,null,null,null,null,null,null,null,null,null,240,null,null,null,null,null,null,null,null,null,null,240,null,null,null,null,null,null,null,null,240,null,null,null,null,240,null,null,null,null,null,null,null,null,240,9.1305959785079049E-2,0.12898539067023468,9.1862482438188023E-2,8.5433668864162607E-2,9.2853334243652288E-2,8.5433668864162607E-2,9.2198511161780392E-2,9.9954846558903993E-2,9.1384531254767642E-2,0.14350656836497608,9.2799999999999994E-2,7.2749999999999995E-2,9.2799999999999994E-2,7.2749999999999995E-2,9.2399999999999996E-2,8.7400000000000005E-2,240,null,null,null,null,null,null,null,null,null,null,null,null,null,null,null,null,240,9.2772527762452831E-2,7.418373669299505E-2,9.3634073243391278E-2,7.418373669299505E-2,9.3634073243391278E-2,7.418373669299505E-2,240,9.7776517551950035E-2,8.1703375637051018E-2,9.7188099286249136E-2,0.12525509744312305,9.8299999999999998E-2,7.9799999999999996E-2,9.8299999999999998E-2,9.4299999999999995E-2,9.7299999999999998E-2,0.13789999999999999,240,9.8699999999999996E-2,7.0400000000000004E-2,9.8699999999999996E-2,7.0400000000000004E-2,9.8299999999999998E-2,8.5000000000000006E-2,240,9.8699999999999996E-2,7.0400000000000004E-2,9.8699999999999996E-2,7.0400000000000004E-2,9.8299999999999998E-2,8.5000000000000006E-2,240,9.8581085598993728E-2,8.6291680190854633E-2,9.7980999116057982E-2,0.10081285788559603,9.7234468743340671E-2,0.14436457969166808,240,9.8599999999999993E-2,7.2099999999999997E-2,240,9.7900000000000001E-2,9.0399999999999994E-2,9.7900000000000001E-2,0.1053,9.7199999999999995E-2,0.14879999999999999,240,9.8199999999999996E-2,8.0799999999999997E-2,240,9.8089982136341569E-2,9.759961546152271E-2,9.767749566677715E-2,0.1121207931562641,9.7160454344014782E-2,0.15567251496233617,240,9.8080000000000001E-2,8.5139999999999993E-2,240,9.8299999999999998E-2,7.9799999999999996E-2,9.7600000000000006E-2,0.11749999999999999,9.7100000000000006E-2,0.16109999999999999,240,9.8699999999999996E-2,7.0400000000000004E-2,240,9.7941796314205021E-2,0.10205764451132211,9.7585523448516023E-2,0.11657882220606353,9.7137897588118374E-2,0.16013054401213558,240,9.8301473798199854E-2,9.2199693339650432E-2,240,9.7644290409629547E-2,0.11365653399011709,9.7400305324307296E-2,0.1281777116848585,9.7092287204561645E-2,0.17172943349093053,240,9.7449999999999995E-2,0.10315000000000001,240,0.15089313897798598,0.11780171935737967,0.15137195383872781,7.4249997551307623E-2,0.15238574386199594,7.2308019698616569E-2,0.15175628564365004,8.6829197393357954E-2,0.15098324509240924,0.13038091919943004,240,0.15088757269520772,0.11935674620881835,0.15134968870761475,7.5805024402746279E-2,0.1522260779869061,7.5805024402746279E-2,0.15165886277811377,9.0326202097487693E-2,0.1509598937992612,0.13387792390355974,240,null,null,null,null,null,null,240,null,null,null,null,null,null,240,0.16092414587821133,0.14480104865392351,240,0.16088090181106232,0.15543432957821579,240,0.16086598226121521,0.16014439619739529,240,0.16124339132101073,8.2345436470408567E-2,0.16089163925985916,0.12589715827648063,0.1615,8.2299999999999998E-2,0.16120000000000001,0.96899999999999997,0.16089999999999999,0.1404,240,0.1614209217976649,7.2260422633920421E-2,0.161788693453911,7.2260422633920421E-2,0.161788693453911,7.2260422633920421E-2,240]
[19,300,7.4410733909850632E-2,7.3163500637724824E-2,7.3381955973428878E-2,0.11671522244379687,7.7011469888065384E-2,6.6128520860717369E-2,7.5486837954415437E-2,8.0649698555458768E-2,7.3631401755586051E-2,0.12420142036153081,300,null,null,null,null,null,null,null,null,null,null,300,null,null,null,null,null,null,null,null,null,null,300,null,null,null,null,null,null,null,null,null,null,300,null,null,null,null,null,null,null,null,300,null,null,null,null,300,null,null,null,null,null,null,null,null,300,7.3283218130618888E-2,0.12738330584405064,7.4015782538610631E-2,8.3831584037978565E-2,7.527503471441517E-2,8.3831584037978565E-2,7.44284630734217E-2,9.8352761732719951E-2,7.3378095577994615E-2,0.14190448353879204,7.5200000000000003E-2,7.2279999999999997E-2,7.5200000000000003E-2,7.2279999999999997E-2,7.4700000000000003E-2,8.6940000000000003E-2,300,null,null,null,null,null,null,null,null,null,null,null,null,null,null,null,null,300,7.5139036228295486E-2,7.3609118484818437E-2,7.6176672177556568E-2,7.3609118484818437E-2,7.6176672177556568E-2,7.3609118484818437E-2,300,7.8712297930655706E-2,8.058122474390525E-2,7.7949223883770263E-2,0.12413294654997732,7.9299999999999995E-2,7.8799999999999995E-2,7.9299999999999995E-2,9.3399999999999997E-2,7.8100000000000003E-2,0.13689999999999999,300,7.9899999999999999E-2,6.9800000000000001E-2,7.9899999999999999E-2,6.9800000000000001E-2,7.9399999999999998E-2,8.4500000000000006E-2,300,7.9899999999999999E-2,6.9800000000000001E-2,7.9899999999999999E-2,6.9800000000000001E-2,7.9399999999999998E-2,8.4500000000000006E-2,300,7.9801257749171239E-2,8.3955557826406679E-2,7.9004077238198606E-2,9.8476735521148079E-2,7.8014710882421678E-2,0.14202845732722011,300,7.9799999999999996E-2,7.0800000000000002E-2,300,7.8799999999999995E-2,8.9200000000000002E-2,7.8799999999999995E-2,0.1037,7.8E-2,0.14729999999999999,300,7.9299999999999995E-2,7.9699999999999993E-2,300,7.9167957368025843E-2,9.4861205009739324E-2,7.8613422767863872E-2,0.10938238270448072,7.7919679723926424E-2,0.15293410451055275,300,7.9060000000000005E-2,8.294E-2,300,7.9299999999999995E-2,7.8799999999999995E-2,7.85E-2,0.1144,7.7899999999999997E-2,0.158,300,7.9899999999999999E-2,6.9800000000000001E-2,300,7.8994123825962104E-2,9.8710964508422552E-2,7.8505717359893271E-2,0.11323214220316397,7.7893324276424966E-2,0.156783864009236,300,7.9452890850929395E-2,8.9456856706816884E-2,300,7.8595891786307159E-2,0.10997686411374767,7.8258175942426872E-2,0.12449804180848907,7.783249117160497E-2,0.16804976361456109,300,7.85E-2,9.9720000000000003E-2,300,0.12103285518040036,0.11746770872000387,0.12163713769364314,7.3915986913931822E-2,0.12277181768327128,7.3915986913931822E-2,0.12203330776853488,8.8437164608673222E-2,0.12112492077818209,0.13198888641474527,300,0.12102723875954684,0.1187959490250769,0.1216146720102291,7.5244227219004839E-2,0.12271536090981831,7.5244227219004839E-2,0.12199884921478439,8.9765404913746225E-2,0.1211166579505133,0.1333171267198183,300,null,null,null,null,null,null,300,null,null,null,null,null,null,300,null,null,300,null,null,300,null,null,300,0.12945703366401726,8.1167552885379857E-2,0.12900096517548254,0.1247192746914519,0.1298,8.1199999999999994E-2,0.12939999999999999,0.95699999999999996,0.129,0.13919999999999999,300,0.12967471619766424,7.1554408676650527E-2,0.13014062927254186,7.1554408676650527E-2,0.13014062927254186,7.1554408676650527E-2,300]
[20,400,5.944444300166183E-2,7.2607933647874282E-2,5.944444300166183E-2,7.2607933647874282E-2,6.2738745752859218E-2,6.4991583999098587E-2,6.0787015870488348E-2,7.9512761693839959E-2,5.8419393132487091E-2,0.123064483499912,400,null,null,null,null,null,null,null,null,null,null,400,null,null,null,null,null,null,null,null,null,null,400,null,null,null,null,null,null,null,null,null,null,400,null,null,null,null,null,null,null,null,400,null,null,null,null,400,null,null,null,null,null,null,null,null,400,5.7995363818502885E-2,0.12575968459917478,5.8976761366905238E-2,8.220796279310276E-2,6.0562521552487696E-2,8.220796279310276E-2,5.9463737196948023E-2,9.6729140487844131E-2,5.8103725630482536E-2,0.1402808622939162,null,null,null,null,null,null,400,null,null,null,null,null,null,null,null,null,null,null,null,null,null,null,null,400,null,null,null,null,null,null,400,6.2598749027124936E-2,7.9952175138548923E-2,6.1607734732089366E-2,0.12350389694462099,6.3299999999999995E-2,7.8100000000000003E-2,6.3299999999999995E-2,9.2700000000000005E-2,6.1800000000000001E-2,0.13619999999999999,400,6.4000000000000001E-2,6.9599999999999995E-2,6.4000000000000001E-2,6.9599999999999995E-2,6.3399999999999998E-2,8.43E-2,400,6.4000000000000001E-2,0.69599999999999995,6.4000000000000001E-2,6.9599999999999995E-2,6.3399999999999998E-2,8.43E-2,400,6.3990535320688616E-2,8.2618168811469661E-2,6.2961332177457724E-2,9.7139346506211061E-2,6.1686583572692633E-2,0.14069106831228312,400,6.4000000000000001E-2,6.9599999999999995E-2,400,6.2799999999999995E-2,8.77E-2,6.2799999999999995E-2,0.1022,6.1600000000000002E-2,0.14580000000000001,400,6.3299999999999995E-2,7.8700000000000006E-2,400,6.3262181867755563E-2,9.2117019836838773E-2,6.2512895887039732E-2,0.10663819753158015,6.1577773981547193E-2,0.15018991933765219,400,6.3070000000000001E-2,8.0740000000000006E-2,400,6.3299999999999995E-2,7.8100000000000003E-2,6.2399999999999997E-2,0.1133,6.1600000000000002E-2,0.15479999999999999,400,6.4000000000000001E-2,6.9599999999999995E-2,400,6.3042493752933318E-2,9.569948352490118E-2,6.2377056696927696E-2,0.11022066121964258,6.1544624144214202E-2,0.15377238302571461,400,6.3643589538306025E-2,8.6766396935284429E-2,400,6.2527962426772263E-2,0.10626564027108056,6.2057814713742214E-2,0.12078681796582194,6.1466361838936626E-2,0.16433853977189397,400,6.2399999999999997E-2,9.6310000000000007E-2,400,9.4615428854154082E-2,0.11662476550766819,9.541175384351272E-2,7.3073043701596146E-2,9.6874704703748787E-2,7.3073043701596146E-2,9.5912545605073132E-2,8.7594221396337532E-2,9.4730754054612523E-2,0.13114594320240958,400,9.4607151641593959E-2,0.11762000089356735,9.5378644993272213E-2,7.4068279087495303E-2,9.679241286322432E-2,7.4068279087495303E-2,9.5862375974200484E-2,8.8589456782236689E-2,9.4718742774737769E-2,0.13214117858830876,400,6.1724694821312154E-2,0.12551392198761013,6.1558184972537427E-2,0.1400350996823515,6.1347288488055561E-2,0.18358682148842353,400,6.1774443622399054E-2,0.13469959358970043,6.1587416542719646E-2,0.14922077128444181,6.1350111889571658E-2,0.19277249309051389,400,null,null,400,null,null,400,null,null,400,0.10136564063259908,7.9979032096885505E-2,0.10076629490681352,0.12353075390295756,0.1018,0.08,0.1013,9.4500000000000001E-2,0.1008,0.1381,400,0.10162993375035236,7.1002702661052755E-2,0.10221828003667162,7.1002702661052755E-2,0.10221828003667162,7.1002702661052755E-2,400]
[21,500,null,null,null,null,null,null,null,null,null,null,500,null,null,null,null,null,null,null,null,null,null,500,null,null,null,null,null,null,null,null,null,null,500,null,null,null,null,null,null,null,null,null,null,500,null,null,null,null,null,null,null,null,500,null,null,null,null,500,null,null,null,null,null,null,null,null,500,4.6024402422866387E-2,0.12574898344048896,4.7274434817492716E-2,8.2197261634416929E-2,4.9089596532090794E-2,8.2197261634416929E-2,4.7763827921719536E-2,9.6718439329158329E-2,4.6125486620353887E-2,0.14027016113523039,null,null,null,null,null,null,500,null,null,null,null,null,null,null,null,null,null,null,null,null,null,null,null,500,null,null,null,null,null,null,500,5.0111942344401687E-2,7.9061011813970725E-2,4.8812485921109497E-2,0.12261273362004275,5.0099999999999999E-2,7.7200000000000005E-2,5.0999999999999997E-2,9.1399999999999995E-2,4.9000000000000002E-2,0.1353,500,null,null,null,null,null,null,500,null,null,null,null,null,null,500,null,null,null,null,null,null,500,null,null,500,5.0299999999999997E-2,8.6400000000000005E-2,5.0299999999999997E-2,0.10100000000000001,4.8899999999999999E-2,0.14449999999999999,500,null,null,500,5.0964020687187021E-2,8.9876949636426132E-2,4.9984551431155488E-2,0.10439812733116752,4.8765486498896331E-2,0.14794984913723958,500,null,null,500,5.0099999999999999E-2,7.7200000000000005E-2,4.99E-2,0.1086,4.87E-2,0.1522,500,null,null,500,5.0700019233432418E-2,9.315092377654062E-2,4.9821689896239432E-2,0.10767210147128201,4.8725865009343138E-2,0.15122382327735406,500,null,null,500,5.0065375821845559E-2,0.10289591211068952,4.9428777935249933E-2,0.11741708980543092,4.8629819063196772E-2,0.16096881161150292,500,null,null,500,7.414537116377945E-2,0.11692171359768505,7.5156601578128576E-2,7.3369991791613007E-2,7.6941455809667089E-2,7.3369991791613007E-2,7.5746501870358418E-2,8.789116948635442E-2,7.4279413311789763E-2,0.13144289129242645,500,7.4134503537012814E-2,0.11795127589599066,7.5113131071062045E-2,7.4399554089918607E-2,7.6835773233297155E-2,7.4399554089918607E-2,7.5682094266754166E-2,8.8920731784659993E-2,7.4264000624900323E-2,0.13247245359073204,500,4.9338218303402029E-2,0.12058430115517824,4.8980737741188891E-2,0.13510547884991966,4.8528861589265899E-2,0.17865720065599169,500,4.9090169409387395E-2,0.12935411079856757,4.8820992030936608E-2,0.14387528849330897,4.8479939890704551E-2,0.18742701029938102,500,null,null,500,null,null,500,null,null,500,7.9670838537343205E-2,7.9069211372858106E-2,7.8879642294454932E-2,0.12262093317893015,8.0199999999999994E-2,7.9100000000000004E-2,7.9600000000000004E-2,9.3600000000000003E-2,7.8899999999999998E-2,0.1371,500,null,null,null,null,null,null,500]
[22,630,null,null,null,null,null,null,null,null,null,null,630,null,null,null,null,null,null,null,null,null,null,630,null,null,null,null,null,null,null,null,null,null,630,null,null,null,null,null,null,null,null,null,null,630,null,null,null,null,null,null,null,null,630,null,null,null,null,630,null,null,null,null,null,null,null,null,630,null,null,null,null,null,null,null,null,null,null,null,null,null,null,null,null,630,null,null,null,null,null,null,null,null,null,null,null,null,null,null,null,null,630,null,null,null,null,null,null,630,4.0522209485551026E-2,7.8293095934025211E-2,4.0522209485551026E-2,7.8293095934025211E-2,4.1500000000000002E-2,7.6600000000000001E-2,4.1500000000000002E-2,9.11E-2,3.9E-2,0.13469999999999999,630,null,null,null,null,null,null,630,null,null,null,null,null,null,630,null,null,null,null,null,null,630,null,null,630,4.0800000000000003E-2,8.43E-2,4.0800000000000003E-2,9.8799999999999999E-2,3.8899999999999997E-2,0.1424,630,null,null,630,4.1575810731095328E-2,8.7222453298304956E-2,4.0309786017012295E-2,0.10174363099304636,3.874057725383917E-2,0.1452953527991184,630,null,null,630,4.1500000000000002E-2,7.6600000000000001E-2,4.0300000000000002E-2,0.1056,3.8699999999999998E-2,0.14910000000000001,630,null,null,630,4.1259861377632406E-2,9.023686371778987E-2,4.011555344072025E-2,0.10475804141253128,3.8693543776540537E-2,0.14830976321860331,630,null,null,630,4.0483676030810684E-2,9.9279320906828353E-2,3.9636533640672905E-2,0.11380049860156974,3.8576943094207942E-2,0.15735222040764177,630,null,null,630,null,null,null,null,null,null,null,null,null,null,630,null,null,null,null,null,null,null,null,null,null,630,3.9554615324130078E-2,0.11626507929662058,3.9069270152192852E-2,0.13078625699136201,3.8457139816851359E-2,0.17433797879743404,630,3.9225986548633844E-2,0.12449634421301428,3.8854488430273101E-2,0.13901752190775568,3.8384670675615615E-2,0.18256924371382771,630,null,null,630,null,null,630,null,null,630,null,null,null,null,null,null,null,null,null,null,630,null,null,null,null,null,null,630]
[23,800,null,null,null,null,null,null,null,null,null,null,800,null,null,null,null,null,null,null,null,null,null,800,null,null,null,null,null,null,null,null,null,null,800,null,null,null,null,null,null,null,null,null,null,800,null,null,null,null,null,null,null,null,800,null,null,null,null,800,null,null,null,null,null,null,null,null,800,null,null,null,null,null,null,null,null,null,null,null,null,null,null,null,null,800,null,null,null,null,null,null,null,null,null,null,null,null,null,null,null,null,800,null,null,null,null,null,null,800,3.3811681304667558E-2,7.7751222907327874E-2,3.3811681304667558E-2,7.7751222907327874E-2,3.4799999999999998E-2,7.5700000000000003E-2,3.4799999999999998E-2,9.0300000000000005E-2,3.1800000000000002E-2,0.1338,800,null,null,null,null,null,null,800,null,null,null,null,null,null,800,null,null,null,null,null,null,800,null,null,800,3.4000000000000002E-2,8.2199999999999995E-2,3.4000000000000002E-2,9.6699999999999994E-2,3.1600000000000003E-2,0.14030000000000001,800,null,null,800,3.4889550547355687E-2,8.4928748317151831E-2,3.334563834025573E-2,9.944992601189323E-2,3.1442185174997618E-2,0.14300164781796526,800,null,null,800,3.4799999999999998E-2,7.5700000000000003E-2,3.3399999999999999E-2,0.10299999999999999,3.15E-2,0.14649999999999999,800,null,null,800,3.4503109016962033E-2,8.7947189067661524E-2,3.3109103415182473E-2,0.10246836676240291,3.138524600982754E-2,0.14602008856847493,800,null,null,800,3.3636259853262074E-2,9.6115792842574641E-2,3.2576254218442659E-2,0.11063697053731604,3.1256233993384189E-2,0.15418869234338806,800,null,null,800,null,null,null,null,null,null,null,null,null,null,800,null,null,null,null,null,null,null,null,null,null,800,3.2545004025367127E-2,0.11211302798872386,3.1919946012286073E-2,0.12663420568346526,3.1134035190665342E-2,0.17018592748953731,800,3.2114713699582853E-2,0.12009044528136759,3.1632964473483835E-2,0.13461162297610899,3.1025231211396775E-2,0.17816334478218104,800,null,null,800,null,null,800,null,null,800,null,null,null,null,null,null,null,null,null,null,800,null,null,null,null,null,null,800]
[24,1000,null,null,null,null,null,null,null,null,null,null,1000,null,null,null,null,null,null,null,null,null,null,1000,null,null,null,null,null,null,null,null,null,null,1000,null,null,null,null,null,null,null,null,null,null,1000,null,null,null,null,null,null,null,null,1000,null,null,null,null,1000,null,null,null,null,null,null,null,null,1000,null,null,null,null,null,null,null,null,null,null,null,null,null,null,null,null,1000,null,null,null,null,null,null,null,null,null,null,null,null,null,null,null,null,1000,null,null,null,null,null,null,1000,2.9429606376277548E-2,7.5913884514587138E-2,2.9429606376277548E-2,7.5913884514587138E-2,3.0300000000000001E-2,7.4300000000000005E-2,3.0300000000000001E-2,8.8900000000000007E-2,2.6800000000000001E-2,0.13239999999999999,1000,null,null,null,null,null,null,1000,null,null,null,null,null,null,1000,null,null,null,null,null,null,1000,null,null,1000,2.9499999999999998E-2,7.9799999999999996E-2,2.9499999999999998E-2,9.4299999999999995E-2,2.6599999999999999E-2,0.13780000000000001,1000,null,null,1000,3.0336971078883033E-2,8.2237503739003959E-2,2.8524682271779674E-2,9.6758681433745344E-2,2.6307381581293178E-2,0.14031040323981739,1000,null,null,1000,3.0300000000000001E-2,7.4300000000000005E-2,2.8799999999999999E-2,0.10009999999999999,2.64E-2,0.14369999999999999,1000,null,null,1000,2.9924385264320626E-2,8.4962642607514322E-2,2.8273745383807593E-2,9.9483820302255721E-2,2.6247501123890304E-2,0.14303554210832775,1000,null,null,1000,2.8935626621377036E-2,9.2776654528729366E-2,2.7669446364472262E-2,0.10729783222347075,2.6102330206432364E-2,0.15084955402954278,1000,null,null,1000,null,null,null,null,null,null,null,null,null,null,1000,null,null,null,null,null,null,null,null,null,null,1000,null,null,null,null,null,null,1000,null,null,null,null,null,null,1000,null,null,1000,null,null,1000,null,null,1000,null,null,null,null,null,null,null,null,null,null,1000,null,null,null,null,null,null,1000]
[null,"Size",{"$f":"F38","v":150},{"$f":"F38","v":150},{"$f":"F38","v":150},{"$f":"F38","v":150},{"$f":"F38","v":150},{"$f":"F38","v":150},{"$f":"F38","v":150},{"$f":"F38","v":150},{"$f":"F38","v":150},{"$f":"F38","v":150},null,{"$f":"L28","v":150},{"$f":"N28","v":150},150,150,{"$f":"F38","v":150},{"$f":"F38","v":150},{"$f":"F38","v":150},{"$f":"F38","v":150},{"$f":"F38","v":150},{"$f":"F38","v":150},null,{"$f":"W28","v":150},{"$f":"Y28","v":150},{"$f":"Z28","v":150},{"$f":"AA28","v":150},{"$f":"F38","v":150},{"$f":"F38","v":150},{"$f":"F38","v":150},{"$f":"F38","v":150},{"$f":"F38","v":150},{"$f":"F38","v":150},null,{"$f":"AH28","v":150},{"$f":"AJ28","v":150},{"$f":"AK28","v":150},{"$f":"AL28","v":150},{"$f":"F38","v":150},{"$f":"F38","v":150},{"$f":"F38","v":150},{"$f":"F38","v":150},{"$f":"F38","v":150},{"$f":"F38","v":150},null,{"$f":"F38","v":150},{"$f":"F38","v":150},{"$f":"F38","v":150},{"$f":"F38","v":150},{"$f":"F38","v":150},{"$f":"F38","v":150},{"$f":"F38","v":150},{"$f":"F38","v":150},null,{"$f":"F38","v":150},{"$f":"F38","v":150},{"$f":"F38","v":150},{"$f":"F38","v":150},null,{"$f":"F38","v":150},{"$f":"F38","v":150},{"$f":"F38","v":150},{"$f":"F38","v":150},{"$f":"F38","v":150},{"$f":"F38","v":150},{"$f":"F38","v":150},{"$f":"F38","v":150},null,{"$f":"BP28","v":150},{"$f":"BR28","v":150},{"$f":"BS28","v":150},{"$f":"BT28","v":150},{"$f":"F38","v":150},{"$f":"F38","v":150},{"$f":"F38","v":150},{"$f":"F38","v":150},{"$f":"F38","v":150},{"$f":"F38","v":150},{"$f":"F38","v":150},{"$f":"F38","v":150},{"$f":"F38","v":150},{"$f":"F38","v":150},{"$f":"F38","v":150},{"$f":"F38","v":150},null,{"$f":"CG28","v":150},{"$f":"CI28","v":150},{"$f":"CJ28","v":150},{"$f":"CK28","v":150},{"$f":"CL28","v":150},{"$f":"CM28","v":150},{"$f":"F38","v":150},{"$f":"F38","v":150},{"$f":"F38","v":150},{"$f":"F38","v":150},{"$f":"F38","v":150},{"$f":"F38","v":150},{"$f":"F38","v":150},{"$f":"F38","v":150},{"$f":"F38","v":150},{"$f":"F38","v":150},null,{"$f":"F38","v":150},{"$f":"F38","v":150},{"$f":"F38","v":150},{"$f":"F38","v":150},{"$f":"F38","v":150},{"$f":"F38","v":150},null,{"$f":"DE28","v":150},{"$f":"DG28","v":150},{"$f":"DH28","v":150},{"$f":"DI28","v":150},{"$f":"DJ28","v":150},{"$f":"DK28","v":150},{"$f":"F38","v":150},{"$f":"F38","v":150},{"$f":"F38","v":150},{"$f":"F38","v":150},null,{"$f":"F38","v":150},{"$f":"F38","v":150},{"$f":"F38","v":150},{"$f":"F38","v":150},{"$f":"F38","v":150},{"$f":"F38","v":150},null,{"$f":"F38","v":150},{"$f":"F38","v":150},{"$f":"F38","v":150},{"$f":"F38","v":150},{"$f":"F38","v":150},{"$f":"F38","v":150},null,{"$f":"F38","v":150},{"$f":"F38","v":150},{"$f":"F38","v":150},{"$f":"F38","v":150},{"$f":"F38","v":150},{"$f":"F38","v":150},null,{"$f":"F38","v":150},{"$f":"F38","v":150},null,{"$f":"F38","v":150},{"$f":"F38","v":150},{"$f":"F38","v":150},{"$f":"F38","v":150},{"$f":"F38","v":150},{"$f":"F38","v":150},null,{"$f":"F38","v":150},{"$f":"F38","v":150},null,{"$f":"F38","v":150},{"$f":"F38","v":150},{"$f":"F38","v":150},{"$f":"F38","v":150},{"$f":"F38","v":150},{"$f":"F38","v":150},null,{"$f":"F38","v":150},{"$f":"F38","v":150},null,{"$f":"F38","v":150},{"$f":"F38","v":150},{"$f":"F38","v":150},{"$f":"F38","v":150},{"$f":"F38","v":150},{"$f":"F38","v":150},null,{"$f":"F38","v":150},{"$f":"F38","v":150},null,{"$f":"F38","v":150},{"$f":"F38","v":150},{"$f":"F38","v":150},{"$f":"F38","v":150},{"$f":"F38","v":150},{"$f":"F38","v":150},null,{"$f":"F38","v":150},{"$f":"F38","v":150},null,{"$f":"F38","v":150},{"$f":"F38","v":150},{"$f":"F38","v":150},{"$f":"F38","v":150},{"$f":"F38","v":150},{"$f":"F38","v":150},null,{"$f":"F38","v":150},{"$f":"F38","v":150},null,{"$f":"GL28","v":150},{"$f":"GN28","v":150},150,150,150,150,{"$f":"F38","v":150},{"$f":"F38","v":150},{"$f":"F38","v":150},{"$f":"F38","v":150},null,{"$f":"GW28","v":150},{"$f":"GY28","v":150},150,150,150,150,{"$f":"F38","v":150},{"$f":"F38","v":150},{"$f":"F38","v":150},{"$f":"F38","v":150},null,{"$f":"F38","v":150},{"$f":"F38","v":150},{"$f":"F38","v":150},{"$f":"F38","v":150},{"$f":"F38","v":150},{"$f":"F38","v":150},null,{"$f":"F38","v":150},{"$f":"F38","v":150},{"$f":"F38","v":150},{"$f":"F38","v":150},{"$f":"F38","v":150},{"$f":"F38","v":150},null,{"$f":"F38","v":150},{"$f":"F38","v":150},null,{"$f":"F38","v":150},{"$f":"F38","v":150},null,{"$f":"F38","v":150},{"$f":"F38","v":150},null,{"$f":"F38","v":150},{"$f":"F38","v":150},{"$f":"F38","v":150},{"$f":"F38","v":150},{"$f":"F38","v":150},{"$f":"F38","v":150},{"$f":"F38","v":150},{"$f":"F38","v":150},{"$f":"F38","v":150},{"$f":"F38","v":150},null,{"$f":"F38","v":150},{"$f":"F38","v":150},{"$f":"F38","v":150},{"$f":"F38","v":150},{"$f":"F38","v":150},{"$f":"F38","v":150},null,{"$f":"F38","v":150},{"$f":"F38","v":150},{"$f":"F38","v":150},{"$f":"F38","v":150},{"$f":"F38","v":150},{"$f":"F38","v":150}]
[null,"Status",{"$f":"I38","v":16},{"$f":"I38","v":16},{"$f":"I38","v":16},{"$f":"I38","v":16},{"$f":"I38","v":16},{"$f":"I38","v":16},{"$f":"I38","v":16},{"$f":"I38","v":16},{"$f":"I38","v":16},{"$f":"I38","v":16},null,{"$f":"L29","v":16},16,16,16,{"$f":"I38","v":16},{"$f":"I38","v":16},{"$f":"I38","v":16},{"$f":"I38","v":16},{"$f":"I38","v":16},{"$f":"I38","v":16},null,{"$f":"W29","v":16},{"$f":"W29","v":16},{"$f":"Z29","v":16},{"$f":"AA29","v":16},{"$f":"I38","v":16},{"$f":"I38","v":16},{"$f":"I38","v":16},{"$f":"I38","v":16},{"$f":"I38","v":16},{"$f":"I38","v":16},null,{"$f":"AH29","v":16},{"$f":"AH29","v":16},{"$f":"AK29","v":16},{"$f":"AL29","v":16},{"$f":"I38","v":16},{"$f":"I38","v":16},{"$f":"I38","v":16},{"$f":"I38","v":16},{"$f":"I38","v":16},{"$f":"I38","v":16},null,{"$f":"I38","v":16},{"$f":"I38","v":16},{"$f":"I38","v":16},{"$f":"I38","v":16},{"$f":"I38","v":16},{"$f":"I38","v":16},{"$f":"I38","v":16},{"$f":"I38","v":16},null,{"$f":"I38","v":16},{"$f":"I38","v":16},{"$f":"I38","v":16},{"$f":"I38","v":16},null,{"$f":"I38","v":16},{"$f":"I38","v":16},{"$f":"I38","v":16},{"$f":"I38","v":16},{"$f":"I38","v":16},{"$f":"I38","v":16},{"$f":"I38","v":16},{"$f":"I38","v":16},null,{"$f":"BP29","v":16},{"$f":"BP29","v":16},{"$f":"BS29","v":16},{"$f":"BT29","v":16},{"$f":"I38","v":16},{"$f":"I38","v":16},{"$f":"I38","v":16},{"$f":"I38","v":16},{"$f":"I38","v":16},{"$f":"I38","v":16},{"$f":"I38","v":16},{"$f":"I38","v":16},{"$f":"I38","v":16},{"$f":"I38","v":16},{"$f":"I38","v":16},{"$f":"I38","v":16},null,{"$f":"CG29","v":16},{"$f":"CG29","v":16},{"$f":"CJ29","v":16},{"$f":"CK29","v":16},{"$f":"CL29","v":16},{"$f":"CM29","v":16},{"$f":"I38","v":16},{"$f":"I38","v":16},{"$f":"I38","v":16},{"$f":"I38","v":16},{"$f":"I38","v":16},{"$f":"I38","v":16},{"$f":"I38","v":16},{"$f":"I38","v":16},{"$f":"I38","v":16},{"$f":"I38","v":16},null,{"$f":"I38","v":16},{"$f":"I38","v":16},{"$f":"I38","v":16},{"$f":"I38","v":16},{"$f":"I38","v":16},{"$f":"I38","v":16},null,{"$f":"DE29","v":16},{"$f":"DE29","v":16},{"$f":"DH29","v":16},{"$f":"DI29","v":16},{"$f":"DJ29","v":16},{"$f":"DK29","v":16},{"$f":"I38","v":16},{"$f":"I38","v":16},{"$f":"I38","v":16},{"$f":"I38","v":16},null,{"$f":"I38","v":16},{"$f":"I38","v":16},{"$f":"I38","v":16},{"$f":"I38","v":16},{"$f":"I38","v":16},{"$f":"I38","v":16},null,{"$f":"I38","v":16},{"$f":"I38","v":16},{"$f":"I38","v":16},{"$f":"I38","v":16},{"$f":"I38","v":16},{"$f":"I38","v":16},null,{"$f":"I38","v":16},{"$f":"I38","v":16},{"$f":"I38","v":16},{"$f":"I38","v":16},{"$f":"I38","v":16},{"$f":"I38","v":16},null,{"$f":"I38","v":16},{"$f":"I38","v":16},null,{"$f":"I38","v":16},{"$f":"I38","v":16},{"$f":"I38","v":16},{"$f":"I38","v":16},{"$f":"I38","v":16},{"$f":"I38","v":16},null,{"$f":"I38","v":16},{"$f":"I38","v":16},null,{"$f":"I38","v":16},{"$f":"I38","v":16},{"$f":"I38","v":16},{"$f":"I38","v":16},{"$f":"I38","v":16},{"$f":"I38","v":16},null,{"$f":"I38","v":16},{"$f":"I38","v":16},null,{"$f":"I38","v":16},{"$f":"I38","v":16},{"$f":"I38","v":16},{"$f":"I38","v":16},{"$f":"I38","v":16},{"$f":"I38","v":16},null,{"$f":"I38","v":16},{"$f":"I38","v":16},null,{"$f":"I38","v":16},{"$f":"I38","v":16},{"$f":"I38","v":16},{"$f":"I38","v":16},{"$f":"I38","v":16},{"$f":"I38","v":16},null,{"$f":"I38","v":16},{"$f":"I38","v":16},null,{"$f":"I38","v":16},{"$f":"I38","v":16},{"$f":"I38","v":16},{"$f":"I38","v":16},{"$f":"I38","v":16},{"$f":"I38","v":16},null,{"$f":"I38","v":16},{"$f":"I38","v":16},null,{"$f":"GL29","v":16},16,16,16,16,16,{"$f":"I38","v":16},{"$f":"I38","v":16},{"$f":"I38","v":16},{"$f":"I38","v":16},null,{"$f":"GW29","v":16},16,16,16,16,16,{"$f":"I38","v":16},{"$f":"I38","v":16},{"$f":"I38","v":16},{"$f":"I38","v":16},null,{"$f":"I38","v":16},{"$f":"I38","v":16},{"$f":"I38","v":16},{"$f":"I38","v":16},{"$f":"I38","v":16},{"$f":"I38","v":16},null,{"$f":"I38","v":16},{"$f":"I38","v":16},{"$f":"I38","v":16},{"$f":"I38","v":16},{"$f":"I38","v":16},{"$f":"I38","v":16},null,{"$f":"I38","v":16},{"$f":"I38","v":16},null,{"$f":"I38","v":16},{"$f":"I38","v":16},null,{"$f":"I38","v":16},{"$f":"I38","v":16},null,{"$f":"I38","v":16},{"$f":"I38","v":16},{"$f":"I38","v":16},{"$f":"I38","v":16},{"$f":"I38","v":16},{"$f":"I38","v":16},{"$f":"I38","v":16},{"$f":"I38","v":16},{"$f":"I38","v":16},{"$f":"I38","v":16},null,{"$f":"I38","v":16},{"$f":"I38","v":16},{"$f":"I38","v":16},{"$f":"I38","v":16},{"$f":"I38","v":16},{"$f":"I38","v":16},null,{"$f":"I38","v":16},{"$f":"I38","v":16},{"$f":"I38","v":16},{"$f":"I38","v":16},{"$f":"I38","v":16},{"$f":"I38","v":16}]
[null,null,{"$f":"C34","v":2},{"$f":"C40","v":"Space"},null,null,null,null,null,null,null,null,null,{"$f":"C30","v":2},{"$f":"D30","v":"Space"},null,null,null,null,null,null,null,null,null,{"$f":"N30","v":2},{"$f":"O30","v":"Space"},null,null,null,null,null,null,null,null,null,{"$f":"N30","v":2},{"$f":"O30","v":"Space"},null,null,null,null,null,null,null,null,null,null,null,null,null,null,null,null,null,null,null,null,null,null,null,null,null,null,null,null,null,null,null,null,{"$f":"N30","v":2},{"$f":"O30","v":"Space"},null,null,null,null,null,null,null,null,null,null,null,null,null,null,null,{"$f":"N30","v":2},{"$f":"O30","v":"Space"},null,null,null,null,null,null,null,null,null,null,null,null,null,null,null,null,null,null,null,null,null,null,{"$f":"N30","v":2},{"$f":"O30","v":"Space"},null,null,null,null,null,null,null,null,null,null,null,null,null,null,null,null,null,null,null,null,null,null,null,null,null,null,null,null,null,null,null,null,null,null,null,null,null,null,null,null,null,null,null,null,null,null,null,null,null,null,null,null,null,null,null,null,null,null,null,null,null,null,null,null,null,null,null,null,null,null,null,null,null,null,null,null,null,null,null,null,null,null,null,{"$f":"N30","v":2},{"$f":"O30","v":"Space"},null,null,null,null,null,null,null,null,null,{"$f":"Y30","v":2},{"$f":"Z30","v":"Space"},null,null,null,null,null,null,null,null,null,null,null,null,null,null,null,null,null,null,null,null,null,null,null,null,null,null,null,null,null,null,null,null,{"$f":"C34","v":2},{"$f":"C40","v":"Space"}]
[null,"R+XL",{"$f":"CHOOSE(C29,C4,C5,C6,C7,C8,C9,C10,C11,C12,C13,C14,C15,C16,C17,C18,C19,C20,C21,C22,C23,C24,C25,C26,C27)","v":0.14956195871910247},7.4834405006890481E-2,0.14907951318648824,0.11838612681296252,0.15047843492089252,7.4834405006890481E-2,0.14988522089674655,8.935558270163188E-2,0.1491549866047632,0.13290730450770391,null,{"$f":"CHOOSE(N29,N4,N5,N6,N7,N8,N9,N10,N11,N12,N13,N14,N15,N16,N17,N18,N19,N20,N21,N22,N23,N24,N25,N26,N27)","v":0.15552651527721226},{"$f":"CHOOSE(O29,O4,O5,O6,O7,O8,O9,O10,O11,O12,O13,O14,O15,O16,O17,O18,O19,O20,O21,O22,O23,O24,O25,O26,O27)","v":7.2993642981123236E-2},{"$f":"CHOOSE(P29,P4,P5,P6,P7,P8,P9,P10,P11,P12,P13,P14,P15,P16,P17,P18,P19,P20,P21,P22,P23,P24,P25,P26,P27)","v":0.15504155081228388},0.11654536478719528,0.15645260375745157,7.2993642981123236E-2,0.15585379912616565,8.7514820675864635E-2,0.15511780656954,0.13106654248193667,null,{"$f":"CHOOSE(Y29,Y4,Y5,Y6,Y7,Y8,Y9,Y10,Y11,Y12,Y13,Y14,Y15,Y16,Y17,Y18,Y19,Y20,Y21,Y22,Y23,Y24,Y25,Y26,Y27)","v":0},0,0,0,0,0,0,0,0,0,null,{"$f":"CHOOSE(AJ29,AJ4,AJ5,AJ6,AJ7,AJ8,AJ9,AJ10,AJ11,AJ12,AJ13,AJ14,AJ15,AJ16,AJ17,AJ18,AJ19,AJ20,AJ21,AJ22,AJ23,AJ24,AJ25,AJ26,AJ27)","v":0},{"$f":"CHOOSE(AK29,AK4,AK5,AK6,AK7,AK8,AK9,AK10,AK11,AK12,AK13,AK14,AK15,AK16,AK17,AK18,AK19,AK20,AK21,AK22,AK23,AK24,AK25,AK26,AK27)","v":0},{"$f":"CHOOSE(AL29,AL4,AL5,AL6,AL7,AL8,AL9,AL10,AL11,AL12,AL13,AL14,AL15,AL16,AL17,AL18,AL19,AL20,AL21,AL22,AL23,AL24,AL25,AL26,AL27)","v":0},{"$f":"CHOOSE(AM29,AM4,AM5,AM6,AM7,AM8,AM9,AM10,AM11,AM12,AM13,AM14,AM15,AM16,AM17,AM18,AM19,AM20,AM21,AM22,AM23,AM24,AM25,AM26,AM27)","v":0},{"$f":"CHOOSE(AN29,AN4,AN5,AN6,AN7,AN8,AN9,AN10,AN11,AN12,AN13,AN14,AN15,AN16,AN17,AN18,AN19,AN20,AN21,AN22,AN23,AN24,AN25,AN26,AN27)","v":0},0,0,0,0,0,null,{"$f":"CHOOSE(AU29,AU4,AU5,AU6,AU7,AU8,AU9,AU10,AU11,AU12,AU13,AU14,AU15,AU16,AU17,AU18,AU19,AU20,AU21,AU22,AU23,AU24,AU25,AU26,AU27)","v":0},0,0,0,0,0,0,0,null,{"$f":"CHOOSE(BD29,BD4,BD5,BD6,BD7,BD8,BD9,BD10,BD11,BD12,BD13,BD14,BD15,BD16,BD17,BD18,BD19,BD20,BD21,BD22,BD23,BD24,BD25,BD26,BD27)","v":0},{"$f":"CHOOSE(BE29,BE4,BE5,BE6,BE7,BE8,BE9,BE10,BE11,BE12,BE13,BE14,BE15,BE16,BE17,BE18,BE19,BE20,BE21,BE22,BE23,BE24,BE25,BE26,BE27)","v":0},{"$f":"CHOOSE(BF29,BF4,BF5,BF6,BF7,BF8,BF9,BF10,BF11,BF12,BF13,BF14,BF15,BF16,BF17,BF18,BF19,BF20,BF21,BF22,BF23,BF24,BF25,BF26,BF27)","v":0},{"$f":"CHOOSE(BG29,BG4,BG5,BG6,BG7,BG8,BG9,BG10,BG11,BG12,BG13,BG14,BG15,BG16,BG17,BG18,BG19,BG20,BG21,BG22,BG23,BG24,BG25,BG26,BG27)","v":0},null,{"$f":"CHOOSE(BI29,BI4,BI5,BI6,BI7,BI8,BI9,BI10,BI11,BI12,BI13,BI14,BI15,BI16,BI17,BI18,BI19,BI20,BI21,BI22,BI23,BI24,BI25,BI26,BI27)","v":0},0,0,0,0,0,0,0,null,{"$f":"CHOOSE(BR29,BR4,BR5,BR6,BR7,BR8,BR9,BR10,BR11,BR12,BR13,BR14,BR15,BR16,BR17,BR18,BR19,BR20,BR21,BR22,BR23,BR24,BR25,BR26,BR27)","v":0.14902308329383737},{"$f":"CHOOSE(BS29,BS4,BS5,BS6,BS7,BS8,BS9,BS10,BS11,BS12,BS13,BS14,BS15,BS16,BS17,BS18,BS19,BS20,BS21,BS22,BS23,BS24,BS25,BS26,BS27)","v":0.13196305428411992},{"$f":"CHOOSE(BT29,BT4,BT5,BT6,BT7,BT8,BT9,BT10,BT11,BT12,BT13,BT14,BT15,BT16,BT17,BT18,BT19,BT20,BT21,BT22,BT23,BT24,BT25,BT26,BT27)","v":0.14933623914849908},{"$f":"CHOOSE(BU29,BU4,BU5,BU6,BU7,BU8,BU9,BU10,BU11,BU12,BU13,BU14,BU15,BU16,BU17,BU18,BU19,BU20,BU21,BU22,BU23,BU24,BU25,BU26,BU27)","v":8.8411332478047888E-2},{"$f":"CHOOSE(BV29,BV4,BV5,BV6,BV7,BV8,BV9,BV10,BV11,BV12,BV13,BV14,BV15,BV16,BV17,BV18,BV19,BV20,BV21,BV22,BV23,BV24,BV25,BV26,BV27)","v":0.14991556876711132},8.8411332478047888E-2,0.14953980999569966,0.10293251017278926,0.14907154661430155,0.14648423197886135,0.14990000000000001,7.3639999999999997E-2,0.14990000000000001,7.3639999999999997E-2,0.1497,8.8279999999999997E-2,null,{"$f":"CHOOSE(CI29,CI4,CI5,CI6,CI7,CI8,CI9,CI10,CI11,CI12,CI13,CI14,CI15,CI16,CI17,CI18,CI19,CI20,CI21,CI22,CI23,CI24,CI25,CI26,CI27)","v":0},0,0,0,0,0,{"$f":"CHOOSE(CO29,CO4,CO5,CO6,CO7,CO8,CO9,CO10,CO11,CO12,CO13,CO14,CO15,CO16,CO17,CO18,CO19,CO20,CO21,CO22,CO23,CO24,CO25,CO26,CO27)","v":0},0,0,0,0,0,0,0,0,0,null,{"$f":"CHOOSE(CZ29,CZ4,CZ5,CZ6,CZ7,CZ8,CZ9,CZ10,CZ11,CZ12,CZ13,CZ14,CZ15,CZ16,CZ17,CZ18,CZ19,CZ20,CZ21,CZ22,CZ23,CZ24,CZ25,CZ26,CZ27)","v":0.14990242203264273},7.5462728773674728E-2,0.15044622835685878,7.5462728773674728E-2,0.15044622835685878,7.5462728773674728E-2,null,{"$f":"CHOOSE(DG29,DG4,DG5,DG6,DG7,DG8,DG9,DG10,DG11,DG12,DG13,DG14,DG15,DG16,DG17,DG18,DG19,DG20,DG21,DG22,DG23,DG24,DG25,DG26,DG27)","v":0.15907787254526889},8.4301849366632695E-2,0.15874287804897871,0.12785357117270477,0.15939999999999999,8.1900000000000001E-2,{"$f":"CHOOSE(DM29,DM4,DM5,DM6,DM7,DM8,DM9,DM10,DM11,DM12,DM13,DM14,DM15,DM16,DM17,DM18,DM19,DM20,DM21,DM22,DM23,DM24,DM25,DM26,DM27)","v":0.15939999999999999},{"$f":"CHOOSE(DN29,DN4,DN5,DN6,DN7,DN8,DN9,DN10,DN11,DN12,DN13,DN14,DN15,DN16,DN17,DN18,DN19,DN20,DN21,DN22,DN23,DN24,DN25,DN26,DN27)","v":9.6500000000000002E-2},{"$f":"CHOOSE(DO29,DO4,DO5,DO6,DO7,DO8,DO9,DO10,DO11,DO12,DO13,DO14,DO15,DO16,DO17,DO18,DO19,DO20,DO21,DO22,DO23,DO24,DO25,DO26,DO27)","v":0.1588},{"$f":"CHOOSE(DP29,DP4,DP5,DP6,DP7,DP8,DP9,DP10,DP11,DP12,DP13,DP14,DP15,DP16,DP17,DP18,DP19,DP20,DP21,DP22,DP23,DP24,DP25,DP26,DP27)","v":0.14000000000000001},null,{"$f":"CHOOSE(DR29,DR4,DR5,DR6,DR7,DR8,DR9,DR10,DR11,DR12,DR13,DR14,DR15,DR16,DR17,DR18,DR19,DR20,DR21,DR22,DR23,DR24,DR25,DR26,DR27)","v":0.15989999999999999},7.0199999999999999E-2,0.15970000000000001,7.0699999999999999E-2,0.1595,8.5400000000000004E-2,null,{"$f":"CHOOSE(DY29,DY4,DY5,DY6,DY7,DY8,DY9,DY10,DY11,DY12,DY13,DY14,DY15,DY16,DY17,DY18,DY19,DY20,DY21,DY22,DY23,DY24,DY25,DY26,DY27)","v":0.15670000000000001},7.0699999999999999E-2,0.15670000000000001,7.0699999999999999E-2,0.15995000000000001,8.5400000000000004E-2,null,{"$f":"CHOOSE(EF29,EF4,EF5,EF6,EF7,EF8,EF9,EF10,EF11,EF12,EF13,EF14,EF15,EF16,EF17,EF18,EF19,EF20,EF21,EF22,EF23,EF24,EF25,EF26,EF27)","v":0.15947736537578208},9.1538280983813836E-2,0.15915895029889404,0.10605945867855525,0.15876126088055625,0.14961118048462729,null,{"$f":"CHOOSE(EM29,EM4,EM5,EM6,EM7,EM8,EM9,EM10,EM11,EM12,EM13,EM14,EM15,EM16,EM17,EM18,EM19,EM20,EM21,EM22,EM23,EM24,EM25,EM26,EM27)","v":0.1595},{"$f":"CHOOSE(EN29,EN4,EN5,EN6,EN7,EN8,EN9,EN10,EN11,EN12,EN13,EN14,EN15,EN16,EN17,EN18,EN19,EN20,EN21,EN22,EN23,EN24,EN25,EN26,EN27)","v":7.5200000000000003E-2},null,{"$f":"CHOOSE(EP29,EP4,EP5,EP6,EP7,EP8,EP9,EP10,EP11,EP12,EP13,EP14,EP15,EP16,EP17,EP18,EP19,EP20,EP21,EP22,EP23,EP24,EP25,EP26,EP27)","v":0.15909999999999999},9.64E-2,0.15909999999999999,0.111,0.15870000000000001,0.1545,null,{"$f":"CHOOSE(EW29,EW4,EW5,EW6,EW7,EW8,EW9,EW10,EW11,EW12,EW13,EW14,EW15,EW16,EW17,EW18,EW19,EW20,EW21,EW22,EW23,EW24,EW25,EW26,EW27)","v":0.1593},{"$f":"CHOOSE(EX29,EX4,EX5,EX6,EX7,EX8,EX9,EX10,EX11,EX12,EX13,EX14,EX15,EX16,EX17,EX18,EX19,EX20,EX21,EX22,EX23,EX24,EX25,EX26,EX27)","v":8.5199999999999998E-2},null,{"$f":"CHOOSE(EZ29,EZ4,EZ5,EZ6,EZ7,EZ8,EZ9,EZ10,EZ11,EZ12,EZ13,EZ14,EZ15,EZ16,EZ17,EZ18,EZ19,EZ20,EZ21,EZ22,EZ23,EZ24,EZ25,EZ26,EZ27)","v":0.15918921728989949},0.10433769852800763,0.15898030034322616,0.118858876222749,0.15871750756133182,0.16241059802882102,null,{"$f":"CHOOSE(FG29,FG4,FG5,FG6,FG7,FG8,FG9,FG10,FG11,FG12,FG13,FG14,FG15,FG16,FG17,FG18,FG19,FG20,FG21,FG22,FG23,FG24,FG25,FG26,FG27)","v":0.15926999999999999},{"$f":"CHOOSE(FH29,FH4,FH5,FH6,FH7,FH8,FH9,FH10,FH11,FH12,FH13,FH14,FH15,FH16,FH17,FH18,FH19,FH20,FH21,FH22,FH23,FH24,FH25,FH26,FH27)","v":9.0789999999999996E-2},null,{"$f":"CHOOSE(FJ29,FJ4,FJ5,FJ6,FJ7,FJ8,FJ9,FJ10,FJ11,FJ12,FJ13,FJ14,FJ15,FJ16,FJ17,FJ18,FJ19,FJ20,FJ21,FJ22,FJ23,FJ24,FJ25,FJ26,FJ27)","v":0.15939999999999999},8.1900000000000001E-2,0.15890000000000001,0.1255,0.15870000000000001,0.16900000000000001,null,{"$f":"CHOOSE(FQ29,FQ4,FQ5,FQ6,FQ7,FQ8,FQ9,FQ10,FQ11,FQ12,FQ13,FQ14,FQ15,FQ16,FQ17,FQ18,FQ19,FQ20,FQ21,FQ22,FQ23,FQ24,FQ25,FQ26,FQ27)","v":0.15970000000000001},{"$f":"CHOOSE(FR29,FR4,FR5,FR6,FR7,FR8,FR9,FR10,FR11,FR12,FR13,FR14,FR15,FR16,FR17,FR18,FR19,FR20,FR21,FR22,FR23,FR24,FR25,FR26,FR27)","v":7.0699999999999999E-2},null,{"$f":"CHOOSE(FT29,FT4,FT5,FT6,FT7,FT8,FT9,FT10,FT11,FT12,FT13,FT14,FT15,FT16,FT17,FT18,FT19,FT20,FT21,FT22,FT23,FT24,FT25,FT26,FT27)","v":0.15910972637491186},0.10908587681903383,0.15893082093539423,0.12360705451377522,0.15870532612054086,0.16715877631984724,null,{"$f":"CHOOSE(GA29,GA4,GA5,GA6,GA7,GA8,GA9,GA10,GA11,GA12,GA13,GA14,GA15,GA16,GA17,GA18,GA19,GA20,GA21,GA22,GA23,GA24,GA25,GA26,GA27)","v":0.15930051065513692},{"$f":"CHOOSE(GB29,GB4,GB5,GB6,GB7,GB8,GB9,GB10,GB11,GB12,GB13,GB14,GB15,GB16,GB17,GB18,GB19,GB20,GB21,GB22,GB23,GB24,GB25,GB26,GB27)","v":9.8734000221589624E-2},null,{"$f":"CHOOSE(GD29,GD4,GD5,GD6,GD7,GD8,GD9,GD10,GD11,GD12,GD13,GD14,GD15,GD16,GD17,GD18,GD19,GD20,GD21,GD22,GD23,GD24,GD25,GD26,GD27)","v":0.15893882638428358},0.12278745554765919,0.15882414784615201,0.13730863324240053,0.15867896854021785,0.18086035504847259,null,{"$f":"CHOOSE(GK29,GK4,GK5,GK6,GK7,GK8,GK9,GK10,GK11,GK12,GK13,GK14,GK15,GK16,GK17,GK18,GK19,GK20,GK21,GK22,GK23,GK24,GK25,GK26,GK27)","v":0.15890000000000001},{"$f":"CHOOSE(GL29,GL4,GL5,GL6,GL7,GL8,GL9,GL10,GL11,GL12,GL13,GL14,GL15,GL16,GL17,GL18,GL19,GL20,GL21,GL22,GL23,GL24,GL25,GL26,GL27)","v":0.1115},null,{"$f":"CHOOSE(GN29,GN4,GN5,GN6,GN7,GN8,GN9,GN10,GN11,GN12,GN13,GN14,GN15,GN16,GN17,GN18,GN19,GN20,GN21,GN22,GN23,GN24,GN25,GN26,GN27)","v":0.24793480396837031},0.11926207651939397,0.24821639195626355,7.5710354713321909E-2,0.2487880413470181,7.4760736843060616E-2,{"$f":"CHOOSE(GT29,GT4,GT5,GT6,GT7,GT8,GT9,GT10,GT11,GT12,GT13,GT14,GT15,GT16,GT17,GT18,GT19,GT20,GT21,GT22,GT23,GT24,GT25,GT26,GT27)","v":0.24842795087183231},{"$f":"CHOOSE(GU29,GU4,GU5,GU6,GU7,GU8,GU9,GU10,GU11,GU12,GU13,GU14,GU15,GU16,GU17,GU18,GU19,GU20,GU21,GU22,GU23,GU24,GU25,GU26,GU27)","v":8.9281914537802015E-2},{"$f":"CHOOSE(GV29,GV4,GV5,GV6,GV7,GV8,GV9,GV10,GV11,GV12,GV13,GV14,GV15,GV16,GV17,GV18,GV19,GV20,GV21,GV22,GV23,GV24,GV25,GV26,GV27)","v":0.24798458968074466},{"$f":"CHOOSE(GW29,GW4,GW5,GW6,GW7,GW8,GW9,GW10,GW11,GW12,GW13,GW14,GW15,GW16,GW17,GW18,GW19,GW20,GW21,GW22,GW23,GW24,GW25,GW26,GW27)","v":0.13283363634387405},null,{"$f":"CHOOSE(GY29,GY4,GY5,GY6,GY7,GY8,GY9,GY10,GY11,GY12,GY13,GY14,GY15,GY16,GY17,GY18,GY19,GY20,GY21,GY22,GY23,GY24,GY25,GY26,GY27)","v":0.24793163333360935},0.12115844301718683,0.24820370941721964,7.7606721211114796E-2,0.24872640184828104,7.7606721211114796E-2,{"$f":"CHOOSE(HE29,HE4,HE5,HE6,HE7,HE8,HE9,HE10,HE11,HE12,HE13,HE14,HE15,HE16,HE17,HE18,HE19,HE20,HE21,HE22,HE23,HE24,HE25,HE26,HE27)","v":0.24839027877052836},{"$f":"CHOOSE(HF29,HF4,HF5,HF6,HF7,HF8,HF9,HF10,HF11,HF12,HF13,HF14,HF15,HF16,HF17,HF18,HF19,HF20,HF21,HF22,HF23,HF24,HF25,HF26,HF27)","v":9.2127898905856181E-2},{"$f":"CHOOSE(HG29,HG4,HG5,HG6,HG7,HG8,HG9,HG10,HG11,HG12,HG13,HG14,HG15,HG16,HG17,HG18,HG19,HG20,HG21,HG22,HG23,HG24,HG25,HG26,HG27)","v":0.24797553972586109},{"$f":"CHOOSE(HH29,HH4,HH5,HH6,HH7,HH8,HH9,HH10,HH11,HH12,HH13,HH14,HH15,HH16,HH17,HH18,HH19,HH20,HH21,HH22,HH23,HH24,HH25,HH26,HH27)","v":0.13567962071192824},null,{"$f":"CHOOSE(HJ29,HJ4,HJ5,HJ6,HJ7,HJ8,HJ9,HJ10,HJ11,HJ12,HJ13,HJ14,HJ15,HJ16,HJ17,HJ18,HJ19,HJ20,HJ21,HJ22,HJ23,HJ24,HJ25,HJ26,HJ27)","v":0},{"$f":"CHOOSE(HK29,HK4,HK5,HK6,HK7,HK8,HK9,HK10,HK11,HK12,HK13,HK14,HK15,HK16,HK17,HK18,HK19,HK20,HK21,HK22,HK23,HK24,HK25,HK26,HK27)","v":0},{"$f":"CHOOSE(HL29,HL4,HL5,HL6,HL7,HL8,HL9,HL10,HL11,HL12,HL13,HL14,HL15,HL16,HL17,HL18,HL19,HL20,HL21,HL22,HL23,HL24,HL25,HL26,HL27,)","v":0},{"$f":"CHOOSE(HM29,HM4,HM5,HM6,HM7,HM8,HM9,HM10,HM11,HM12,HM13,HM14,HM15,HM16,HM17,HM18,HM19,HM20,HM21,HM22,HM23,HM24,HM25,HM26,HM27)","v":0},{"$f":"CHOOSE(HN29,HN4,HN5,HN6,HN7,HN8,HN9,HN10,HN11,HN12,HN13,HN14,HN15,HN16,HN17,HN18,HN19,HN20,HN21,HN22,HN23,HN24,HN25,HN26,HN27)","v":0},{"$f":"CHOOSE(HO29,HO4,HO5,HO6,HO7,HO8,HO9,HO10,HO11,HO12,HO13,HO14,HO15,HO16,HO17,HO18,HO19,HO20,HO21,HO22,HO23,HO24,HO25,HO26,HO27)","v":0},null,{"$f":"CHOOSE(HQ29,HQ4,HQ5,HQ6,HQ7,HQ8,HQ9,HQ10,HQ11,HQ12,HQ13,HQ14,HQ15,HQ16,HQ17,HQ18,HQ19,HQ20,HQ21,HQ22,HQ23,HQ24,HQ25,HQ26,HQ27)","v":0},0,0,0,0,0,null,{"$f":"CHOOSE(HX29,HX4,HX5,HX6,HX7,HX8,HX9,HX10,HX11,HX12,HX13,HX14,HX15,HX16,HX17,HX18,HX19,HX20,HX21,HX22,HX23,HX24,HX25,HX26,HX27)","v":0.26449930719904918},{"$f":"CHOOSE(HY29,HY4,HY5,HY6,HY7,HY8,HY9,HY10,HY11,HY12,HY13,HY14,HY15,HY16,HY17,HY18,HY19,HY20,HY21,HY22,HY23,HY24,HY25,HY26,HY27)","v":0.15169497308974389},null,{"$f":"CHOOSE(IA29,IA4,IA5,IA6,IA7,IA8,IA9,IA10,IA11,IA12,IA13,IA14,IA15,IA16,IA17,IA18,IA19,IA20,IA21,IA22,IA23,IA24,IA25,IA26,IA27)","v":0.26447469127380918},{"$f":"CHOOSE(IB29,IB4,IB5,IB6,IB7,IB8,IB9,IB10,IB11,IB12,IB13,IB14,IB15,IB16,IB17,IB18,IB19,IB20,IB21,IB22,IB23,IB24,IB25,IB26,IB27)","v":0.16401723434763354},null,{"$f":"CHOOSE(ID29,ID4,ID5,ID6,ID7,ID8,ID9,ID10,ID11,ID12,ID13,ID14,ID15,ID16,ID17,ID18,ID19,ID20,ID21,ID22,ID23,ID24,ID25,ID26,ID27)","v":0.26446666653665918},{"$f":"CHOOSE(IE29,IE4,IE5,IE6,IE7,IE8,IE9,IE10,IE11,IE12,IE13,IE14,IE15,IE16,IE17,IE18,IE19,IE20,IE21,IE22,IE23,IE24,IE25,IE26,IE27)","v":0.16937663939373665},null,{"$f":"CHOOSE(IG29,IG4,IG5,IG6,IG7,IG8,IG9,IG10,IG11,IG12,IG13,IG14,IG15,IG16,IG17,IG18,IG19,IG20,IG21,IG22,IG23,IG24,IG25,IG26,IG27)","v":0.2646879115093671},8.5530537921604838E-2,0.26448976357384574,0.12908225972767687,{"$f":"CHOOSE(IK29,IK4,IK5,IK6,IK7,IK8,IK9,IK10,IK11,IK12,IK13,IK14,IK15,IK16,IK17,IK18,IK19,IK20,IK21,IK22,IK23,IK24,IK25,IK26,IK27)","v":0.26479999999999998},8.5500000000000007E-2,{"$f":"CHOOSE(IM29,IM4,IM5,IM6,IM7,IM8,IM9,IM10,IM11,IM12,IM13,IM14,IM15,IM16,IM17,IM18,IM19,IM20,IM21,IM22,IM23,IM24,IM25,IM26,IM27)","v":0.26469999999999999},{"$f":"CHOOSE(IN29,IN4,IN5,IN6,IN7,IN8,IN9,IN10,IN11,IN12,IN13,IN14,IN15,IN16,IN17,IN18,IN19,IN20,IN21,IN22,IN23,IN24,IN25,IN26,IN27)","v":0.10009999999999999},{"$f":"CHOOSE(IO29,IO4,IO5,IO6,IO7,IO8,IO9,IO10,IO11,IO12,IO13,IO14,IO15,IO16,IO17,IO18,IO19,IO20,IO21,IO22,IO23,IO24,IO25,IO26,IO27)","v":0.26450000000000001},{"$f":"CHOOSE(IP29,IP4,IP5,IP6,IP7,IP8,IP9,IP10,IP11,IP12,IP13,IP14,IP15,IP16,IP17,IP18,IP19,IP20,IP21,IP22,IP23,IP24,IP25,IP26,IP27)","v":0.14360000000000001},null,{"$f":"CHOOSE(IR29,IR4,IR5,IR6,IR7,IR8,IR9,IR10,IR11,IR12,IR13,IR14,IR15,IR16,IR17,IR18,IR19,IR20,IR21,IR22,IR23,IR24,IR25,IR26,IR27)","v":0.26481221755338441},7.3416378567458085E-2,0.26503567994254401,7.3416378567458085E-2,0.26503567994254401,7.3416378567458085E-2,null,{"$f":"CHOOSE(IY29,IY4,IY5,IY6,IY7,IY8,IY9,IY10,IY11,IY12,IY13,IY14,IY15,IY16,IY17,IY18,IY19,IY20,IY21,IY22,IY23,IY24,IY25,IY26,IY27)","v":0},0,0,0,0,0]
[null,"Install",null,null,null,null,{"$f":"IF(AND(C34=1,C40=\"touching\"),C31,IF(AND(C34=1,C40=\"Space\"),E31,IF(AND(C34=2,C40=\"trefoil\"),G31,IF(AND(C34=2,C40=\"Touching\"),I31,IF(AND(C34=2,C40=\"Space\"),K31,\"\")))))","v":0.1491549866047632},null,null,{"$f":"IF(AND(C34=1,C40=\"touching\"),D31,IF(AND(C34=1,C40=\"Space\"),F31,IF(AND(C34=2,C40=\"trefoil\"),H31,IF(AND(C34=2,C40=\"Touching\"),J31,IF(AND(C34=2,C40=\"Space\"),L31,\"\")))))","v":0.13290730450770391},null,null,null,null,null,null,null,{"$f":"IF(AND(N30=1,O30=\"touching\"),N31,IF(AND(N30=1,O30=\"Space\"),P31,IF(AND(N30=2,O30=\"trefoil\"),R31,IF(AND(N30=2,O30=\"Touching\"),T31,IF(AND(N30=2,O30=\"Space\"),V31,\"\")))))","v":0.15511780656954},null,null,{"$f":"IF(AND(N30=1,O30=\"touching\"),O31,IF(AND(N30=1,O30=\"Space\"),Q31,IF(AND(N30=2,O30=\"trefoil\"),S31,IF(AND(N30=2,O30=\"Touching\"),U31,IF(AND(N30=2,O30=\"Space\"),W31,\"\")))))","v":0.13106654248193667},null,null,null,null,null,null,null,{"$f":"IF(AND(Y30=1,Z30=\"touching\"),Y31,IF(AND(Y30=1,Z30=\"Space\"),AA31,IF(AND(Y30=2,Z30=\"trefoil\"),AC31,IF(AND(Y30=2,Z30=\"Touching\"),AE31,IF(AND(Y30=2,Z30=\"Space\"),AG31,\"\")))))","v":0},null,null,{"$f":"IF(AND(Y30=1,Z30=\"touching\"),Z31,IF(AND(Y30=1,Z30=\"Space\"),AB31,IF(AND(Y30=2,Z30=\"trefoil\"),AD31,IF(AND(Y30=2,Z30=\"Touching\"),AF31,IF(AND(Y30=2,Z30=\"Space\"),AH31,\"\")))))","v":0},null,null,null,null,null,null,null,{"$f":"IF(AND(AJ30=1,AK30=\"touching\"),AJ31,IF(AND(AJ30=1,AK30=\"Space\"),AL31,IF(AND(AJ30=2,AK30=\"trefoil\"),AN31,IF(AND(AJ30=2,AK30=\"Touching\"),AP31,IF(AND(AJ30=2,AK30=\"Space\"),AR31,\"\")))))","v":0},null,null,{"$f":"IF(AND(AJ30=1,AK30=\"touching\"),AK31,IF(AND(AJ30=1,AK30=\"Space\"),AM31,IF(AND(AJ30=2,AK30=\"trefoil\"),AO31,IF(AND(AJ30=2,AK30=\"Touching\"),AQ31,IF(AND(AJ30=2,AK30=\"Space\"),AS31,\"\")))))","v":0},null,null,null,{"$f":"IF(F36=2,AU31,IF(F36=3,AW31,IF(F36=4,AY31,IF(F36=5,BA31))))","v":false},null,null,null,{"$f":"IF(F36=2,AV31,IF(F36=3,AX31,IF(F36=4,AZ31,IF(F36=5,BB31))))","v":false},null,null,null,null,{"$f":"IF(F36=2,BD31,IF(F36=3,BF31,\"\"))","v":""},null,{"$f":"IF(F36=2,BE31,IF(F36=3,BG31,\"\"))","v":""},null,null,{"$f":"IF(F36=2,BI31,IF(F36=3,BK31,IF(F36=4,BM31,IF(F36=5,BO31))))","v":false},null,null,null,{"$f":"IF(F36=2,BJ31,IF(F36=3,BL31,IF(F36=4,BN31,IF(F36=5,BP31))))","v":false},null,null,null,null,null,null,null,null,{"$f":"IF(AND(BR30=1,BS30=\"touching\"),BR31,IF(AND(BR30=1,BS30=\"Space\"),BT31,IF(AND(BR30=2,BS30=\"trefoil\"),BV31,IF(AND(BR30=2,BS30=\"Touching\"),BX31,IF(AND(BR30=2,BS30=\"Space\"),BZ31,\"\")))))","v":0.14907154661430155},null,null,{"$f":"IF(AND(BR30=1,BS30=\"touching\"),BS31,IF(AND(BR30=1,BS30=\"Space\"),BU31,IF(AND(BR30=2,BS30=\"trefoil\"),BW31,IF(AND(BR30=2,BS30=\"Touching\"),BY31,IF(AND(BR30=2,BS30=\"Space\"),CA31,\"\")))))","v":0.14648423197886135},null,null,{"$f":"IF(F36=2,CB31,IF(F36=3,CD31,IF(F36=4,CF31,)))","v":0},null,null,{"$f":"IF(F36=2,CC31,IF(F36=3,CE31,IF(F36=4,CG31,)))","v":0},null,null,null,null,null,null,null,{"$f":"IF(AND(CI30=1,CJ30=\"touching\"),CI31,IF(AND(CI30=1,CJ30=\"Space\"),CK31,IF(AND(CI30=2,CJ30=\"trefoil\"),CM31,IF(AND(CI30=2,CJ30=\"Touching\"),CO31,IF(AND(CI30=2,CJ30=\"Space\"),CQ31,\"\")))))","v":0},null,null,{"$f":"IF(AND(CI30=1,CJ30=\"touching\"),CJ31,IF(AND(CI30=1,CJ30=\"Space\"),CL31,IF(AND(CI30=2,CJ30=\"trefoil\"),CN31,IF(AND(CI30=2,CJ30=\"Touching\"),CP31,IF(AND(CI30=2,CJ30=\"Space\"),CR31,\"\")))))","v":0},null,null,{"$f":"IF(F36=2,CS31,IF(F36=3,CU31,IF(F36=4,CW31,)))","v":0},null,null,{"$f":"IF(F36=2,CT31,IF(F36=3,CV31,IF(F36=4,CX31,)))","v":0},null,null,null,{"$f":"IF(F36=2,CZ31,IF(F36=3,DB31,IF(F36=4,DD31,)))","v":0},null,null,{"$f":"IF(F36=2,DA31,IF(F36=3,DC31,IF(F36=4,DE31,)))","v":0},null,null,null,null,null,null,null,{"$f":"IF(AND(DG30=1,DH30=\"touching\"),DG31,IF(AND(DG30=1,DH30=\"Space\"),DI31,IF(AND(DG30=2,DH30=\"trefoil\"),DK31,IF(AND(DG30=2,DH30=\"Touching\"),DM31,IF(AND(DG30=2,DH30=\"Space\"),DO31,\"\")))))","v":0.1588},null,null,{"$f":"IF(AND(DG30=1,DH30=\"touching\"),DH31,IF(AND(DG30=1,DH30=\"Space\"),DJ31,IF(AND(DG30=2,DH30=\"trefoil\"),DL31,IF(AND(DG30=2,DH30=\"Touching\"),DN31,IF(AND(DG30=2,DH30=\"Space\"),DP31,\"\")))))","v":0.14000000000000001},null,null,null,{"$f":"IF(F36=2,DR31,IF(F36=3,DT31,IF(F36=4,DV31,)))","v":0},null,null,{"$f":"IF(F36=2,DS31,IF(F36=3,DU31,IF(F36=4,DW31,)))","v":0},null,null,null,{"$f":"IF(F36=2,DY31,IF(F36=3,EA31,IF(F36=4,EC31,)))","v":0},null,null,{"$f":"IF(F36=2,DZ31,IF(F36=3,EB31,IF(F36=4,ED31,)))","v":0},null,null,null,{"$f":"IF(C40=\"trefoil\",EF31,IF(C40=\"Touching\",EH31,IF(C40=\"Space\",EJ31,\"\")))","v":0.15876126088055625},null,null,{"$f":"IF(C40=\"trefoil\",EG31,IF(C40=\"Touching\",EI31,IF(C40=\"Space\",EK31,\"\")))","v":0.14961118048462729},null,null,null,{"$f":"IF(F36=3,EM31,\"\")","v":""},{"$f":"IF(F36=3,EN31,\"\")","v":""},null,{"$f":"IF(C40=\"trefoil\",EP31,IF(C40=\"Touching\",ER31,IF(C40=\"Space\",ET31,\"\")))","v":0.15870000000000001},null,null,{"$f":"IF(C40=\"trefoil\",EQ31,IF(C40=\"Touching\",ES31,IF(C40=\"Space\",EU31,\"\")))","v":0.1545},null,null,null,{"$f":"IF(F36=3,EW31,\"\")","v":""},{"$f":"IF(F36=3,EX31,\"\")","v":""},null,{"$f":"IF(C40=\"trefoil\",EZ31,IF(C40=\"Touching\",FB31,IF(C40=\"Space\",FD31,\"\")))","v":0.15871750756133182},null,null,{"$f":"IF(C40=\"trefoil\",FA31,IF(C40=\"Touching\",FC31,IF(C40=\"Space\",FE31,\"\")))","v":0.16241059802882102},null,null,null,{"$f":"IF(F36=3,FG31,\"\")","v":""},{"$f":"IF(F36=3,FH31,\"\")","v":""},null,{"$f":"IF(C40=\"trefoil\",FJ31,IF(C40=\"Touching\",FL31,IF(C40=\"Space\",FN31,\"\")))","v":0.15870000000000001},null,null,{"$f":"IF(C40=\"trefoil\",FK31,IF(C40=\"Touching\",FM31,IF(C40=\"Space\",FO31,\"\")))","v":0.16900000000000001},null,null,null,{"$f":"IF(F36=3,FQ31,\"\")","v":""},{"$f":"IF(F36=3,FR31,\"\")","v":""},null,{"$f":"IF(C40=\"trefoil\",FT31,IF(C40=\"Touching\",FV31,IF(C40=\"Space\",FX31,\"\")))","v":0.15870532612054086},null,null,{"$f":"IF(C40=\"trefoil\",FU31,IF(C40=\"Touching\",FW31,IF(C40=\"Space\",FY31,\"\")))","v":0.16715877631984724},null,null,null,{"$f":"IF(F36=3,GA31,\"\")","v":""},{"$f":"IF(F36=3,GB31,\"\")","v":""},null,{"$f":"IF(C40=\"trefoil\",GD31,IF(C40=\"Touching\",GF31,IF(C40=\"Space\",GH31,\"\")))","v":0.15867896854021785},null,null,{"$f":"IF(C40=\"trefoil\",GE31,IF(C40=\"Touching\",GG31,IF(C40=\"Space\",GI31,\"\")))","v":0.18086035504847259},null,null,null,{"$f":"IF(F36=3,GK31,\"\")","v":""},{"$f":"IF(F36=3,GL31,\"\")","v":""},null,null,null,null,null,{"$f":"IF(AND(GN30=1,GO30=\"touching\"),GN31,IF(AND(GN30=1,GO30=\"Space\"),GP31,IF(AND(GN30=2,GO30=\"trefoil\"),GR31,IF(AND(GN30=2,GO30=\"Touching\"),GT31,IF(AND(GN30=2,GO30=\"Space\"),GV31,\"\")))))","v":0.24798458968074466},null,null,{"$f":"IF(AND(GN30=1,GO30=\"touching\"),GO31,IF(AND(GN30=1,GO30=\"Space\"),GQ31,IF(AND(GN30=2,GO30=\"trefoil\"),GS31,IF(AND(GN30=2,GO30=\"Touching\"),GU31,IF(AND(GN30=2,GO30=\"Space\"),GW31,\"\")))))","v":0.13283363634387405},null,null,null,null,null,null,null,{"$f":"IF(AND(GY30=1,GZ30=\"touching\"),GY31,IF(AND(GY30=1,GZ30=\"Space\"),HA31,IF(AND(GY30=2,GZ30=\"trefoil\"),HC31,IF(AND(GY30=2,GZ30=\"Touching\"),HE31,IF(AND(GY30=2,GZ30=\"Space\"),HG31,\"\")))))","v":0.24797553972586109},null,null,{"$f":"IF(AND(GY30=1,GZ30=\"touching\"),GZ31,IF(AND(GY30=1,GZ30=\"Space\"),HB31,IF(AND(GY30=2,GZ30=\"trefoil\"),HD31,IF(AND(GY30=2,GZ30=\"Touching\"),HF31,IF(AND(GY30=2,GZ30=\"Space\"),HH31,\"\")))))","v":0.13567962071192824},null,null,null,{"$f":"IF(C40=\"trefoil\",HJ31,IF(C40=\"Touching\",HL31,IF(C40=\"Space\",HN31,\"\")))","v":0},null,null,{"$f":"IF(C40=\"trefoil\",HK31,IF(C40=\"Touching\",HM31,IF(C40=\"Space\",HO31,\"\")))","v":0},null,null,null,{"$f":"IF(C40=\"trefoil\",HQ31,IF(C40=\"Touching\",HS31,IF(C40=\"Space\",HU31,\"\")))","v":0},null,null,{"$f":"IF(C40=\"trefoil\",HR31,IF(C40=\"Touching\",HT31,IF(C40=\"Space\",HV31,\"\")))","v":0},null,null,null,{"$f":"IF(C40=\"Space\",HX31,\"\")","v":0.26449930719904918},{"$f":"IF(C40=\"Space\",HY31,\"\")","v":0.15169497308974389},null,{"$f":"IF(C40=\"Space\",IA31,\"\")","v":0.26447469127380918},{"$f":"IF(C40=\"Space\",IB31,\"\")","v":0.16401723434763354},null,{"$f":"IF(C40=\"Space\",ID31,\"\")","v":0.26446666653665918},{"$f":"IF(C40=\"Space\",IE31,\"\")","v":0.16937663939373665},null,null,null,null,null,{"$f":"IF(AND(IG30=1,IH30=\"touching\"),IG31,IF(AND(IG30=1,IH30=\"Space\"),II31,IF(AND(IG30=2,IH30=\"trefoil\"),IK31,IF(AND(IG30=2,IH30=\"Touching\"),IM31,IF(AND(IG30=2,IH30=\"Space\"),IO31,\"\")))))","v":0.26450000000000001},null,null,{"$f":"IF(AND(IG30=1,IH30=\"touching\"),IH31,IF(AND(IG30=1,IH30=\"Space\"),IJ31,IF(AND(IG30=2,IH30=\"trefoil\"),IL31,IF(AND(IG30=2,IH30=\"Touching\"),IN31,IF(AND(IG30=2,IH30=\"Space\"),IP31,\"\")))))","v":0.14360000000000001},null,null,null,{"$f":"IF(F36=2,IR31,IF(F36=3,IT31,IF(F36=4,IV31,\"\")))","v":""},null,null,{"$f":"IF(F36=2,IS31,IF(F36=3,IU31,IF(F36=4,IW31,\"\")))","v":""},null,null,null,{"$f":"IF(F36=2,IY31,IF(F36=3,JA31,IF(F36>=4,JC31,\"\")))","v":""},null,null,{"$f":"IF(F36=2,IZ31,IF(F36=3,JB31,IF(F36>=4,JD31,\"\")))","v":""}]
[]
[null,"Check 1-3 phase",{"$f":"IF(Interface!C9=\"AC 1-Phase,  2-Wire\",1,IF(Interface!C9=\"AC 3-Phase,  3-Wire\",2))","v":2},"1= single"]
[null,null,null,"2= 3 Phase",null,null,null,null,null,null,null,null,null,null,null,null,null,null,"IEC/TIS","Install"]
[null,"Type of Cable",{"$f":"Interface!C11","v":"Building Wire Cable"},null,"Core",{"$f":"Interface!C15","v":1},null,null,null,null,1,"60227 IEC 01 THW",null,null,{"$f":"IF(F36=1,G32,0)","v":0.1491549866047632},{"$f":"IF(F36=1,J32,0)","v":0.13290730450770391},"PVC","CU",1,0]
[null,null,null,null,null,null,null,null,null,null,2,"60227 IEC 02 THW (f)",null,null,{"$f":"IF(F36=1,R32,0)","v":0.15511780656954},{"$f":"IF(F36=1,U32,0)","v":0.13106654248193667},"PVC","CU Flex",1,0,"0=Air only"]
[null,"Cable Name",{"$f":"Interface!C13","v":"60227 IEC 01 THW"},null,"Size",{"$f":"IF(I52=1,Interface!C17,IF(I52=2,Interface!C18,IF(I52=3,Interface!C19,IF(I52=4,Interface!C20))))","v":150},null,"Status Ch",{"$f":"IF(F38=0.5,1,IF(F38=0.75,2,IF(F38=1,3,IF(F38=1.5,4,IF(F38=2.5,5,IF(F38=4,6,IF(F38=6,7,IF(F38=10,8,IF(F38=16,9,IF(F38=25,10,IF(F38=35,11,IF(F38=50,12,IF(F38=70,13,IF(F38=95,14,IF(F38=120,15,IF(F38=150,16,IF(F38=185,17,IF(F38=240,18,IF(F38=300,19,IF(F38=400,20,IF(F38=500,21,IF(F38=630,22,IF(F38=800,23,IF(F38=1000,24,\"\"))))))))))))))))))))))))","v":16},null,3,"60227 IEC 05 IV",null,null,{"$f":"IF(F36=1,AC32,0)","v":0},{"$f":"IF(F36=1,AF32,0)","v":0},"PVC","CU",1,0,"1= Air+G"]
[null,null,null,null,null,null,null,null,null,null,4,"60227 IEC 06 IV (f)",null,null,{"$f":"IF(F36=1,AN32,0)","v":0},{"$f":"IF(F36=1,AQ32,0)","v":0},"PVC","CU Flex",1,0,"2=G only"]
[null,"Installation",{"$f":"IF(OR(H66=1,H66=3),F67,IF(H66=2,F68,\"\"))","v":"Space"},null,"Status ",{"$f":"IF(C38=L36,1,IF(C38=L37,2,IF(C38=L38,3,IF(C38=L39,4,IF(C38=L40,5,IF(C38=L41,6,IF(C38=L42,7,IF(C38=L43,8,IF(C38=L44,9,IF(C38=L45,10,IF(C38=L46,11,IF(C38=L47,12,IF(C38=L48,13,IF(C38=L49,14,IF(C38=L50,15,IF(C38=L51,16,IF(C38=L52,17,IF(C38=L53,18,IF(C38=L54,19,IF(C38=L55,20,IF(C38=L56,21,IF(C38=L57,22,IF(C38=L58,23,IF(C38=L59,24,IF(C38=L60,25,IF(C38=L61,26,IF(C38=L62,27,\"\")))))))))))))))))))))))))))","v":1},null,{"$f":"IF(H66=3,\"Space\",C40)","v":"Space"},null,null,5,"60227 IEC 10 ",null,null,{"$f":"AU32","v":false},{"$f":"AY32","v":false},"PVC","CU",1,0]
[null,null,null,null,null,null,null,null,null,null,6,"60227 IEC 52 VCT",null,null,{"$f":"BD32","v":""},{"$f":"BF32","v":""},"PVC","CU Flex",1,0]
[null,"Length of Cable",{"$f":"Interface!C35/1000","v":9.9000000000000005E-2},"km","Current",{"$f":"Interface!C37","v":99},null,null,null,null,7,"60227 IEC 53 VCT",null,null,{"$f":"BI32","v":false},{"$f":"BM32","v":false},"PVC","CU Flex",1,0]
[null,null,null,null,null,null,null,null,null,null,8,"NYY",null,null,{"$f":"IF(F36=1,BV32,CB32)","v":0.14907154661430155},{"$f":"IF(F36=1,BY32,CE32)","v":0.14648423197886135},"PVC","CU",1,1]
[null,"Power Factor",{"$f":"Interface!C28","v":0.85},null,null,null,null,null,null,null,9,"VCT",null,null,{"$f":"IF(F36=1,CM32,CS32)","v":0},{"$f":"IF(F36=1,BV312,CV32)","v":0},"PVC","CU Flex",1,0]
[null,null,null,null,null,null,"Sing-Multi same Cable",null,{"$f":"IF(F36>=2,0.5,0)","v":0},null,10,"NYY-SWA",null,null,{"$f":"CZ32","v":0},{"$f":"DC32","v":0},"PVC","CU",1,1]
[null,"Bundle",{"$f":"Interface!C33","v":6},null,null,null,"Status Size",null,{"$f":"F40+I45","v":1},null,11,"FD-0.6/1KV-CV",null,null,{"$f":"IF(F36=1,DK32,DR32)","v":0.1588},{"$f":"IF(F36=1,DN32,DU32)","v":0.14000000000000001},"XLPE","CU",2,1,null,null,null,null,null,null,null,null,null,null,null,null,null,null,null,null,null,null,null,null,null,null,null,null,null,null,null,null,null,null,null,null,null,null,null,null,null,null,null,null,null,null,null,null,null,null,null,null,null,null,null,null,null,null,null,null,null,null,null,null,null,null,null,null,null,null,null,null,null,null,null,null,null,null,null,null,null,null,null,null,null,null,null,null,null,null,null,null,null,null,null,null,null,null,null,null,null,null,null,null,null,null,null,null,null,null,null,null,null,null,null,null,null,null,null,null,null,null,null,null,null,null,null,null,null,null,null,null,null,null,null,null,null,null,null,null,null,null,null,null,null,null,null,null,null,null,null,null,null,null,null,null,null,null,null,null,null,null,null,null,null,null,null,null,null,null,null,null,null,null,null,null,null,null,null,null,null,null,null,null,null,null,null,null,null,null,null,null,null,null,null,null,null,null,null,null,null,null,null,null,null,null,null,null,null,null,null,null,null,null,null,null,null,null,null,null,null,null,null,null,null,"P"]
[null,null,null,null,null,null,null,null,null,null,12,"FD-0.6/1KV-CV-SWA",null,null,{"$f":"DY32","v":0},{"$f":"EB32","v":0},"XLPE","CU",2,1]
[null,"R",{"$f":"CHOOSE(F40,O36,O37,O38,O39,O40,O41,O42,O43,O44,O45,O46,O47,O48,O49,O50,O51,O52,O53,O54,O55,O56,O57,O58,O59,O60,O61,O62)","v":0.1491549866047632},null,"Xl",{"$f":"CHOOSE(F40,P36,P37,P38,P39,P40,P41,P42,P43,P44,P45,P46,P47,P48,P49,P50,P51,P52,P53,P54,P55,P56,P57,P58,P59,P60,P61,P62)","v":0.13290730450770391},null,null,null,null,13,"1.8/3KV-CV",null,null,{"$f":"IF(F36=1,EF32,EM32)","v":0.15876126088055625},{"$f":"IF(F36,EI32,EN32)","v":0.14961118048462729},"XLPE","CU",2,1]
[null,null,null,null,null,null,null,null,null,null,14,"3.6/6KV-CV",null,null,{"$f":"IF(F36=1,EP32,EW32)","v":0.15870000000000001},{"$f":"IF(F36=1,ES32,EX32)","v":0.1545},"XLPE","CU",2,1]
[null,"Impedance",{"$f":"C48*C44+F48*SIN(ACOS(C44))","v":0.19679500568995534},null,null,null,null,null,null,null,15,"6/10KV-CV",null,null,{"$f":"IF(F36=1,EZ32,FG32)","v":0.15871750756133182},{"$f":"IF(F36=1,FC32,FH32)","v":0.16241059802882102},"XLPE","CU",2,1]
[null,null,null,null,null,null,null,null,"High Light",null,16,"8.7/15KV-CV",null,null,{"$f":"IF(F36=1,FT32,GA32)","v":0.15870532612054086},{"$f":"IF(F36=1,FW32,GB32)","v":0.16715877631984724},"XLPE","CU",2,1]
[null,"Impredance Used",{"$f":"C50/C46","v":3.2799167614992554E-2},null,null,"R used",{"$f":"H57","v":0.148366},null,{"$f":"IF(OR(I46<=9.5,I46=26),1,IF(OR(I46<=15,I46=26.5),2,IF(I46<=20,3,IF(OR(I46<=25,I46=27.5),4,\"\"))))","v":1},null,17,"12/20KV-CV",null,null,{"$f":"IF(F36=1,FJ32,FQ32)","v":0.15870000000000001},{"$f":"IF(F36=1,FM32,FR32)","v":0.16900000000000001},"XLPE","CU",2,1]
[null,null,null,null,null,"Voltage drop dc","Type",{"$f":"CHOOSE(F40,R36,R37,R38,R39,R40,R41,R42,R43,R44,R45,R46,R47,R48,R49,R50,R51,R52,R53,R54,R55,R56,R57,R58,R59,R60,R61,R62)","v":"CU"},null,null,18,"18/30KV-CV",null,null,{"$f":"IF(F36=1,GD32,GK32)","v":0.15867896854021785},{"$f":"IF(F36=1,GG32,GL32)","v":0.18086035504847259},"XLPE","CU",2,1]
[null,null,null,null,null,null,"Ins.",{"$f":"CHOOSE(F40,Q36,Q37,Q38,Q39,Q40,Q41,Q42,Q43,Q44,Q45,Q46,Q47,Q48,Q49,Q50,Q51,Q52,Q53,Q54,Q55,Q56,Q57,Q58,Q59,Q60,Q61,Q62)","v":"PVC"},null,null,19,"69KV-CE",null,null,{"$f":"IF(F36=1,HJ32,0)","v":0},{"$f":"IF(F36=1,HM32,0)","v":0},"XLPE","CU",2,2]
[null,null,null,null,null,null,"Temp",{"$f":"IF(H54=\"PVC\",70,IF(H54=\"PE\",75,IF(H54=\"XLPE\",90,\"\")))","v":70},"°C",null,20,"115KV-CE",null,null,{"$f":"IF(F36=1,HQ32,0)","v":0},{"$f":"IF(F36=1,HT32,0)","v":0},"XLPE","CU",2,2]
[null,"Vdrop 1 Phase",{"$f":"2*F42*C42*C52","v":0.64292928358908408},null,null,null,"R20°C",{"$f":"Rdc!K5","v":0.124},"Ω/km",".",21,"THWA",null,null,{"$f":"IF(F36=1,GR32,0)","v":0.24798458968074466},{"$f":"IF(F36=1,GU32,0)","v":0.13283363634387405},"PVC","AL",1,0]
[null,null,null,null,null,null,"Rdc Max",{"$f":"H56*(1+H58*(H55-20))","v":0.148366},"Ω/km",".",22,"THWA-C",null,null,{"$f":"IF(F36=1,HC32,0)","v":0.24797553972586109},{"$f":"IF(F36=1,HF32,0)","v":0.13567962071192824},"PVC","AL",1,0]
[null,"Vdrop 3 Phase",{"$f":"SQRT(3)*F42*C42*C52","v":0.55679309242507635},null,null,null,"Alpha",{"$f":"IF(H53=\"AL\",0.00403,IF(OR(H53=\"CU\",H53=\"CU Flex\"),0.00393,\"\"))","v":3.9300000000000003E-3},null,null,23,"15KV-CC",null,null,{"$f":"IF(F36=1,HX32,0)","v":0.26449930719904918},{"$f":"IF(F36=1,HY32,0)","v":0.15169497308974389},"XLPE","AL",1,0]
["***","Vdrop Show",{"$f":"IF(Interface!C9=\"AC 1-Phase,  2-Wire\",D!C56,IF(Interface!C9=\"AC 3-Phase,  3-Wire\",D!C58,\"\"))","v":0.55679309242507635},"***",null,"V drop",{"$f":"2*C42*F42*G52","v":2.9082703319999998},null,null,null,24,"25KV-CC",null,null,{"$f":"IF(F36=1,IA32,0)","v":0.26447469127380918},{"$f":"IF(F36=1,IB32,0)","v":0.16401723434763354},"XLPE","AL",1,0]
[null,"Group Core",{"$f":"IF(F40=1,1,IF(F40=2,1,IF(F40=3,1,IF(F40=4,1,IF(F40=19,1,IF(F40=20,1,IF(F40=21,1,IF(F40=22,1,IF(F40=23,1,IF(F40=24,1,IF(F40=25,1,IF(F40=13,2,IF(F40=14,2,IF(F40=15,2,IF(F40=16,2,IF(F40=17,2,IF(F40=18,2,IF(F40=6,3,IF(F40=5,4,IF(F40=7,4,IF(F40=10,5,IF(F40=12,5,IF(F40=8,6,IF(F40=9,6,IF(OR(F40=11,F40=26),6,IF(F40=27,7,\"\"))))))))))))))))))))))))))","v":1},null,null,null,null,null,null,null,25,"35KV-CC",null,null,{"$f":"IF(F36=1,ID32,0)","v":0.26446666653665918},{"$f":"IF(F36=1,IE32,0)","v":0.16937663939373665},"XLPE","AL",1,0]
[null,"Size Type",{"$f":"IF(D!$I$46=1,\"6\",IF(D!$I$46=2,\"6\",IF(D!$I$46=3,\"2\",IF(D!$I$46=4,\"2\",IF(D!$I$46=5.5,\"5\",IF(D!$I$46=6.5,\"1\",IF(D!$I$46=7.5,\"3\",IF(D!$I$46=8,\"4\",IF(D!$I$46=8.5,\"7\",IF(D!$I$46=9,\"8\",IF(D!$I$46=9.5,\"8\",IF(D!$I$46=10.5,\"7\",IF(D!$I$46=11,\"6\",IF(D!$I$46=11.5,\"6\",IF(D!$I$46=12.5,\"6\",IF(OR(D!$I$46=13,D!$I$46=26.5),\"12\",IF(D!$I$46=14,\"11\",IF(D!$I$46=14.5,\"12\",IF(D!$I$46=15,\"13\",IF(D!$I$46=15.5,\"10\",IF(D!$I$46=16,\"15\",IF(D!$I$46=16.5,\"16\",IF(D!$I$46=17,\"17\",IF(D!$I$46=17.5,\"18\",IF(D!$I$46=18,\"17\",IF(D!$I$46=18.5,\"18\",IF(D!$I$46=19,\"19\",IF(D!$I$46=20,\"19\",IF(D!$I$46=21,\"9\",IF(OR(D!$I$46=22,D!$I$46=26),\"9\",IF(D!$I$46=23,\"20\",IF(D!$I$46=24,\"20\",IF(D!$I$46=25,\"14\",IF(D!$I$46=27.5,\"22\"))))))))))))))))))))))))))))))))))","v":"6"},null,null,{"$f":"IF(D!I46=1,\"Size 1.5-400 mm²\",IF(D!I46=2,\"Size 1.5-400 mm²\",IF(D!I46=3,\"Size 0.5-1.0 mm²\",IF(D!I46=4,\"Size 0.5-1.0 mm²\",IF(D!I46=5,\"Size 1.5-35 mm²\",IF(D!I46=5.5,\"Size 1.5-35 mm²\",IF(D!I46=6.5,\"Size 0.5-0.75 mm²\",IF(D!I46=7,\"Size 0.75-2.5 mm²\",IF(D!I46=8,\"Size 1.0-500 mm²\",IF(D!I46=8.5,\"Size 50-300 mm²\",IF(D!I46=9,\"Size4-35 mm²\",IF(D!I46=9.5,\"Size4-35 mm²\",IF(D!I46=10.5,\"Size 50-300 mm²\",IF(D!I46=11,\"Size 1.5-1000 mm²\",IF(D!I46=11.5,\"Size 1.5-400 mm²\",IF(D!I46=12.5,\"Size 1.5-400 mm²\",IF(D!I46=13,\"Size 10-400 mm²\",IF(D!I46=13.5,\"Size 10-400 mm²\",IF(D!I46=14,\"Size 10-1000 mm²\",IF(D!I46=14.5,\"Size 10-400 mm²\",IF(D!I46=15,\"Size 16-1000 mm²\",IF(D!I46=15.5,\"Size 16-400 mm².\",IF(D!I46=16,\"Size 25-1000 mm².\",IF(D!I46=16.5,\"Size 25-400 mm²\",IF(D!I46=17,\"Size 35-1000 mm²\",IF(D!I46=17.5,\"Size 35-400 mm²\",IF(D!I46=18,\"Size 35-1000 mm²\",IF(D!I46=18.5,\"Size 35-400 mm²\",IF(D!I46=19,\"Size 400-800 mm²\",IF(D!I46=20,\"Size 400-800 mm²\",IF(D!I46=21,\"Size 10-500 mm²\",IF(D!I46=22,\"Size 10-500 mm²\",IF(D!I46=23,\"Size 35-240mm²\",IF(D!I46=24,\"Size 35-240 mm²\",IF(D!I46=25,\"Size 50-240 mm²\",\"\")))))))))))))))))))))))))))))))))))","v":"Size 1.5-400 mm²"},null,null,null,null,26,"FD-0.6/1KV-AL-CV",null,null,{"$f":"IF(F36=1,IK32,IR32)","v":0.26450000000000001},{"$f":"IF(F36=1,IN32,IU32)","v":0.14360000000000001},"XLPE","AL",2,1]
[null,null,null,null,null,null,null,null,null,null,27,"CVV",null,null,{"$f":"IY32","v":""},{"$f":"JB32","v":""},"PVC","CU Flex",1,0]
["Sing or Multi",{"$f":"IF(Interface!C15=1,\"Single Core\",\"Multi-core\")","v":"Single Core"}]
[null,null,null,"导体尺寸"]
[null,null,"1 ENG",null,null,null,null,null,null,null,"IEC/TIS",null,null,null,null,null,null,null,{"$f":"CHOOSE(F40,S36,S37,S38,S39,S40,S41,S42,S43,S44,S45,S46,S47,S48,S49,S50,S51,S52,S53,S54,S55,S56,S57,S58,S59,S60,S61,S62)","v":1},{"$f":"CHOOSE(F40,T36,T37,T38,T39,T40,T41,T42,T43,T44,T45,T46,T47,T48,T49,T50,T51,T52,T53,T54,T55,T56,T57,T58,T59,T60,T61,T62)","v":0}]
[null,{"$f":"LG!B8","v":1},"2 THAI",null,null,"Installation Check",null,{"$f":"IF(I46=26,1,IF(I46=1,1,IF(I46=2,1,IF(I46=3,1,IF(I46=4,1,IF(I46=5,2,IF(I46=5.5,2,IF(I46=6,2,IF(I46=6.5,2,IF(I46=7,2,IF(I46=7.5,2,IF(I46=8,1,IF(I46=8.5,2,IF(I46=9,1,IF(I46=9.5,2,IF(I46=10.5,2,IF(I46=11,1,IF(I46=26.5,2,IF(I46=11.5,2,IF(I46=12,2,IF(I46=12.5,2,IF(I46=13,1,IF(I46=13.5,2,IF(I46=14,1,IF(I46=14.5,2,IF(I46=15,1,IF(I46=15.5,2,IF(I46=16,1,IF(I46=16.5,2,IF(I46=17,1,IF(I46=17.5,2,IF(I46=18,1,IF(I46=18.5,2,IF(I46=19,1,IF(I46=19.5,2,IF(I46=20,1,IF(I46=20.5,2,IF(I46=21,1,IF(I46=22,1,IF(I46=23,3,IF(I46=24,3,IF(I46=25,3,2))))))))))))))))))))))))))))))))))))))))))","v":1},null,null,{"$f":"CHOOSE(F40,S36,S37,S38,S39,S40,S41,S42,S43,S44,S45,S46,S47,S48,S49,S50,S51,S52,S53,S54,S55,S56,S57,S58,S59,S60,S61,S62,)","v":1}]
[null,null,"3 JAPAN",null,null,{"$f":"IF(H66=1,Interface!C22,IF(H66=2,Interface!C23,IF(H66=3,Interface!C24,\"\")))","v":"Space"},null,null,null,null,null,null,null,null,"A/G",{"$f":"IF(D!T65=0,ZZZ,IF(D!T65=1,AG,IF(D!T65=2,G,\"\")))","v":0}]
[null,null,"4 Chainese",null,null,{"$f":"IF(F67=\"Multi - Core\",\"Space\",\"\")","v":""}]
["Code Select Size",{"$f":"IF(AND(B66=1,I52=1),\"Select Size\",IF(AND(B66=2,I52=1),\"เลือกขนาดสาย\",IF(AND(B66=3,I52=1),\"導体サイズ\",IF(AND(B66=4,I52=1),\"导体尺寸\",\"\"))))","v":"Select Size"},{"$f":"IF(I52=1,\"mm²\",\"\")","v":"mm²"}]
[null,{"$f":"IF(AND(B66=1,I52=2),\"Select Size\",IF(AND(B66=2,I52=2),\"เลือกขนาดสาย\",IF(AND(B66=3,I52=2),\"導体サイズ\",IF(AND(B66=4,I52=2),\"导体尺寸\",\"\"))))","v":""},{"$f":"IF(I52=2,\"mm²\",\"\")","v":""}]
[null,{"$f":"IF(AND(B66=1,I52=3),\"Select Size\",IF(AND(B66=2,I52=3),\"เลือกขนาดสาย\",IF(AND(B66=3,I52=3),\"導体サイズ\",IF(AND(B66=4,I52=3),\"导体尺寸\",\"\"))))","v":""},{"$f":"IF(I52=3,\"mm²\",\"\")","v":""}]
[null,{"$f":"IF(AND(B66=1,I52=4),\"Select Size\",IF(AND(B66=2,I52=4),\"เลือกขนาดสาย\",IF(AND(B66=3,I52=4),\"導体サイズ\",IF(AND(B66=4,I52=4),\"导体尺寸\",\"\"))))","v":""},{"$f":"IF(I52=4,\"mm²\",\"\")","v":""},null,null,"AC 1-Phase,  2-Wire"]
[null,null,null,null,null,"AC 3-Phase,  3-Wire"]
[]
[null,{"$f":"IF(H66>=2,\"Multi - Core\",\"\")","v":""},{"$f":"IF(AND(B66=1,H66=2),\"Laying\",IF(AND(B66=2,H66=2),\"ลักษณะการวาง\",IF(AND(B66=3,H66=2),\"施工条件\",IF(AND(B66=4,H66=2),\"电线安置方式\",\"\"))))","v":""}]
[null,{"$f":"IF(H66=3,\"Space\",\"\")","v":""},{"$f":"IF(AND(B66=1,H66=1),\"Select Laying type\",IF(AND(B66=2,H66=1),\"เลือกรูปแบบการวาง\",IF(AND(B66=3,H66=1),\"施工条件\",IF(AND(B66=4,H66=1),\"电线安置方式\",\"\"))))","v":"Select Laying type"}]
[null,null,{"$f":"IF(AND(B66=1,H66=3),\"Laying Type\",IF(AND(B66=2,H66=3),\"รูปแบบการวาง\",IF(AND(B66=3,H66=3),\"施工条件\",IF(AND(B66=4,H66=3),\"Laying Type\",\"\"))))","v":""}]
[]
[]
[null,null,"Select Size"]
[null,null,"เลือกขนาดสาย"]
[null,null,"導体サイズ"]

{"sheet":"LG","index":4,"n_rows":26,"n_cols":56,"rows_kept":26,"cut":false,"hidden":true,"merged":[]}
["Sheet Name","Topic1","Topic2","Topic3","Topic4","Topic5","Topic6","Topic7","Topic8","Topic9","Topic10","Topic11","Topic12","Topic13","Topic14","Topic15","Topic16","Topic17","Topic18","Topic19","Topic20","Topic21","Topic22","Topic23","Topic24","Topic25","Topic26","Topic27","Topic28","Topic29","Topic30","Topic31","Topic32","Topic33","Topic34","Topic35","Topic36","Topic37","Topic38","Topic39","Topic40","Topic41","Topic42","Topic43","Topic44","Topic45","Topic46","Topic47","Topic48","Topic49","Topic51","Topic52","Topic53","Topic54","Topic55","Topic56"]
["VOLTAGE DROP CALCULATION (Yazaki Cable)","Type of Cable","Cable Name","Select No. of Core","Select Size","Select Installation","Frequency 50 Hz (Thailand, Myanmar, Cambodia,China)","Power Factor","Type of Voltage Drop","Length of Cable","Metre","Current","A","System Voltage","V","Part of System","Voltage Drop","V","Voltage Drop","%","Result","VOLTAGE DROP CALCULATION (Other Cable)","Current Used","A","Length","Metre","AC Resistance","Ω/km","Reactance XL","Power Factor","Impedance","Ω/km","Type of Voltage Drop","System Voltage","V","Part of System","Voltage Drop","V","Voltage Drop","%","Result","NOTE: NEC RECOMMENDATIONS "," Maximum combined voltage drop for both the feeder and branch circuit shouldn't ","exceed 5%, and the maximum on the feeder or branch circuit shouldn't exceed 3%",{"$f":"\"\"","v":""},{"$f":"\"\"","v":""},{"$f":"IF(Interface!G37<Interface!C37,\"Load Current Exceed Capacity of Cable\",IF(AND(Interface!C31=\"Main Feeder\",Interface!C43>3),\"% Voltage Drop Exceed the Standard\",IF(AND(Interface!C31=\"Branch Circuits\",Interface!C43>3),\"% Voltage Drop Exceed the Standard\",\"Can Use\")))","v":"Can Use"},"Installation","Maximum Capacity","Ambient",{"$f":"IF(AND(Interface!C81=\"Main Feeder\",Interface!C85>3),\"% Voltage Drop Exceed the Standard\",IF(AND(Interface!C81=\"Branch Circuits\",Interface!C85>3),\"% Voltage Drop Exceed the Standard\",\"Can Use\"))","v":"Can Use"},"Input Data","Select Data","Do not Edit","Can Use","Cable/Phase"]
["การคำนวนแรงดันตก(สายไฟฟ้า ยาซากิ)","ประเภทสายไฟฟ้า","ชนิดของสายไฟฟ้า","เลือกจำนวนแกน","เลือกขนาดสาย","เลือกลักษณะการติดตั้ง","ความถี่ 50 เฮิร์ต (ประเทศไทย, พม่า, กัมพูชา, จีน)","ตัวประกอบกำลัง","รูปแบบของแรงดันตก","ความยาวของสาย","เมตร","กระแสไฟฟ้า","แอมแปร์","แรงดันไฟฟ้า","โวลท์","ชนิดของระบบ","แรงดันตก","โวลท์","แรงดันตก","เปอร์เซ็นต์","ผลลัพธ์","การคำนวนแรงดันตก(สายยี่ห้ออื่น)","ขนาดกระแสไฟฟ้าใช้งาน","แอมแปร์","ความยาวสาย","เมตร","ค่าความต้านทานไฟฟ้ากระแสสลับ","โอห์ม/กิโลเมตร","ค่าความต้านทานเหนี่ยวนำ(XL)","ตัวประกอบกำลัง","ค่าความต้านทานรวม(Z)","โอห์ม/กิโลเมตร","รูปแบบของแรงดันตก","แรงดันไฟฟ้า","โวลท์","ชนิดของระบบ","แรงดันตก","โวลท์","แรงดันตก","เปอร์เซ็นต์","ผลลัพธ์","หมายเหตุ :   ข้อแนะนำจากNEC","แรงดันตกสูงสุดของสายป้อนหรือวงจรย่อยไม่ควรเกิน 3% และผลรวมแรงดันตกระหว่างสายป้อนและวงจรย่อยไม่ควรเกิน 5 % ",{"$f":"\"\"","v":""},{"$f":"\"\"","v":""},{"$f":"\"\"","v":""},{"$f":"IF(Interface!G37<Interface!C37,\"กระแสใช้งานมากกว่าพิกัดสายไฟฟ้า\",IF(AND(Interface!C31=\"Main Feeder\",Interface!C43>3),\"% แรงดันตกเกินมาตรฐาน\",IF(AND(Interface!C31=\"Branch Circuits\",Interface!C43>3),\"% แรงดันตกเกินมาตรฐาน\",\"สามารถใช้งานได้\")))","v":"สามารถใช้งานได้"},"ลักษณะการติดตั้ง","พิกัดกระแสสูงสุด","อุณหภูมิโดยรอบ",{"$f":"IF(AND(Interface!C81=\"Main Feeder\",Interface!C85>3),\"% แรงดันตกเกินมาตรฐาน\",IF(AND(Interface!C81=\"Branch Circuits\",Interface!C85>3),\"% แรงดันตกเกินมาตรฐาน\",\"สามารถใช้งานได้\"))","v":"สามารถใช้งานได้"},"ข้อมูลขาเข้า","การเลือกข้อมูล","กรุณาอย่าแก้ไข","สามารถใช้งานได้","จำนวน/เฟส"]
["電圧降下計算表(タイ矢崎電線製品用)","ケーブル区分","ケーブル品種名","線芯数","導体サイズ","Select Installation","周波数 50Hz(タイ、ミャンマー、カンボジア、中国)","力率","通電方式","ケーブル条長","m","電流値","A","使用電圧","V","使用系統","電圧降下","V","電圧降下率","%","結果","電圧降下計算表(タイ矢崎カタログ以外及び他社製品)","使用電流値","A","ケーブル条長","m","AC抵抗値","Ω/km","リアクタンス","力率","インピーダンス","Ω/km","通電方式","システム電圧","V","使用系統","電圧降下","V","電圧降下率","%","結果","注記：NEC 推奨値"," Maximum combined voltage drop for both the feeder and branch circuit shouldn't ","exceed 5%, and the maximum on the feeder or branch circuit shouldn't exceed 3%",{"$f":"\"\"","v":""},{"$f":"\"\"","v":""},{"$f":"IF(Interface!G37<Interface!C37,\"入力した電流値が許容電流を超えています。\",IF(AND(Interface!C31=\"Main Feeder\",Interface!C43>3),\"%電圧降下率が基準値を超えます\",IF(AND(Interface!C31=\"Branch Circuits\",Interface!C43>3),\"%電圧降下率が基準値を超えます\",\"使用可\")))","v":"使用可"},"施工環境","最大許容電流値","周囲温度",{"$f":"IF(AND(Interface!C81=\"Main Feeder\",Interface!C85>3),\"%電圧降下率が基準値を超えます\",IF(AND(Interface!C81=\"Branch Circuits\",Interface!C85>3),\"%電圧降下率が基準値を超えます\",\"使用可\"))","v":"使用可"},"データ入力","データ選定","修正禁止","使用可","Cable/Phase"]
["电压损失计算表（矢崎电线）","电线型式","电线品种","线芯数","导体尺寸","选择安装方式","频率 50 Hz\n(泰国，缅甸，柬埔寨，中国)","电功率系数","通电方式","电线长度","m","电流","A","使用电压","V","应用系统","电压损失","V","电压损失率","%","结果","电压损失计算表（其他公司电线产品）","使用电流",null,"电线长度","米","交流电阻","Ω/km","电抗\n（XL）","电功率系数","阻抗","Ω/km","通电方式","使用电压","V","应用系统","电压损失","V","电压损失率","%","结果","备注：NEC 推荐标准","分支线路和配电线路的最高合计电压损失率不得超过5%，每个分支电路或配电线路的最大电压损失率为3%",{"$f":"\"\"","v":""},{"$f":"\"\"","v":""},{"$f":"\"\"","v":""},{"$f":"IF(Interface!G37<Interface!C37,\"电流不超过电线电流负荷量\",IF(AND(Interface!C31=\"Main Feeder\",Interface!C43>3),\"电压损失率超过标准值\",IF(AND(Interface!C31=\"Branch Circuits\",Interface!C43>3),\"电压损失率超过标准值\",\"合格\")))","v":"合格"},"安装方式","最大电流负荷","周围温度",{"$f":"IF(AND(Interface!C81=\"Main Feeder\",Interface!C85>3),\"电压损失率超过标准值\",IF(AND(Interface!C81=\"Branch Circuits\",Interface!C85>3),\"电压损失率超过标准值\",\"合格\"))","v":"合格"},"输入数据","选择数据","禁止修改","合格","Cable/Phase"]
[]
[]
["Choose",1,"English"]
[null,null,"ภาษาไทย"]
[null,null,"日本語"]
[null,null,"中文"]
[null,null,1]
[]
[]
[]
[]
[]
[]
[null,null,null,null,"% Voltage Drop Exceed the Standard"]
[null,1,{"$f":"Interface!C45","v":"Can Use"},{"$f":"IF(C20=E19,0,IF(C20=E20,0,IF(C20=E21,0,IF(C20=E22,0,IF(C20=E23,0,IF(C20=E24,0,IF(C20=E25,0,IF(C20=E26,0,1))))))))","v":1},"% แรงดันตกเกินมาตรฐาน"]
[null,2,{"$f":"Interface!C88","v":"Can Use"},{"$f":"IF(C21=E19,0,IF(C21=E20,0,IF(C21=E21,0,IF(C21=E22,0,1))))","v":1},"%電圧降下率が基準値を超えます"]
[null,null,null,null,"电压损失率超过标准值"]
[null,null,null,null,"电流不超过电线电流负荷量"]
[null,null,null,null,"กระแสใช้งานมากกว่าพิกัดสายไฟฟ้า"]
[null,null,null,null,"入力した電流値が許容電流を超えています。"]
[null,null,null,null,"Load Current Exceed Capacity of Cable"]

{"sheet":"L","index":5,"n_rows":48,"n_cols":60,"rows_kept":48,"cut":false,"hidden":true,"merged":[]}
[null,"Status Bar",{"$f":"IF(Interface!C11=L!B2,1,IF(Interface!C11=L!C2,2,IF(Interface!C11=L!D2,3,IF(Interface!C11=L!E2,4,IF(Interface!C11=L!F2,5,IF(Interface!C11=L!G2,6,IF(Interface!C11=L!A2,7)))))))","v":1},null,null,null,null,"CoreN",null,"Size","Install","Bundle","Type",null,"Install2","Install3","Size0","Size1","Size2","Size3","Size4","Size5","Size6","Size7","Size8","Size9","Size10","Size11","Size12","Size13","Size14","Size15","Size16","Size17","Size18","Size19","Size20","Size21","Core1","Core2","Core3","Core4","Core5","Core6","TYPE",null,null,"VD",null,null,"VD1",null,null,null,null,"Install5","Check","NO",null,"Size22"]
["Control","Building Wire Cable","LV Power Cable","MV Power Cable","HV Power Cable","AL Building Wire Cable","AL HV Power Cable",1,null,0.5,"Space","No","AC 1-Phase,  2-Wire",null,"Multicore","Space",1.5,0.5,0.5,0.75,1,1.5,1.5,50,4,10,16,10,10,16,50,25,25,35,35,400,35,1.5,1,1,2,2,1,2,"CU",1,null,"Vdrop AC 3 Ph.",null,"PVC","Vdrop AC 3 Ph.",null,1,0.7,"Main Feeder","Space","O",1,2,0.5]
["CVV","60227 IEC 01 THW","NYY-SWA","1.8/3KV-CV","69KV-CE","THWA","15KV-CC",2,null,0.75,"Touching",1,"AC 3-Phase,  3-Wire",null,null,null,2.5,0.75,0.75,1,1.5,2.5,2.5,70,6,16,25,16,16,25,70,35,35,50,50,500,50,2.5,null,3,3,3,2,3,"CU Flex",2,null,"Vdrop AC 1 Ph.",null,"PE","Vdrop AC 1 Ph.",null,2,0.75,"Branch Circuits","Touching","P",2,3,0.75]
[null,"60227 IEC 02 THW (f)","FD-0.6/1KV-CV","3.6/6KV-CV","115KV-CE","THWA-C","25KV-CC",3,null,1,"Trefoil",2,null,null,null,null,4,null,1,1.5,2.5,4,4,95,10,25,35,25,25,35,95,50,50,70,70,630,70,4,null,null,4,null,3,4,"Aluminium",3,null,"Vdrop DC",null,"XLPE",null,null,3,0.8,null,null,null,3,4,1]
[null,"60227 IEC 05 IV","FD-0.6/1KV-CV-SWA","6/10KV-CV",null,null,"35KV-CC",4,null,1.5,null,3,null,null,null,null,6,null,null,2.5,4,6,6,120,16,35,50,35,35,50,120,70,70,95,95,800,95,6,null,null,5,null,4,null,null,4,null,null,null,null,null,null,4,0.85,null,null,null,4,5,1.5]
[null,"60227 IEC 06 IV (f)","FD-0.6/1KV-AL-CV","8.7/15KV-CV",null,null,null,5,null,2.5,null,4,null,null,null,null,10,null,null,null,6,10,10,150,25,50,70,50,50,70,150,95,95,120,120,null,120,10,null,null,null,null,null,null,null,5,null,null,null,null,null,null,5,0.9,null,null,null,5,6,2.5]
[null,"60227 IEC 10 ",null,"12/20KV-CV",null,null,null,null,null,4,null,5,null,null,null,null,16,null,null,null,10,16,16,185,35,70,95,70,70,95,185,120,120,150,150,null,150,16,null,null,null,null,null,null,null,6,null,null,null,null,null,null,6,0.95,null,null,null,6,7,4]
[null,"60227 IEC 52 VCT",null,"18/30KV-CV",null,null,null,null,null,6,null,6,null,null,null,null,25,null,null,null,16,25,25,240,null,95,120,95,95,120,240,150,150,185,185,null,185,25,null,null,null,null,null,null,null,7,null,null,null,null,null,null,7,1,null,null,null,7,8,6]
[null,"60227 IEC 53 VCT",null,null,null,null,null,null,null,10,null,7,null,null,null,null,35,null,null,null,25,35,35,300,null,120,150,120,120,150,null,185,185,240,240,null,240,35,null,null,null,null,null,null,null,8,null,null,null,null,null,null,8,null,null,null,null,8,9]
[null,"NYY",null,null,null,null,null,null,null,16,"Install0",8,null,null,null,null,50,null,null,null,35,null,50,null,null,150,185,150,150,185,null,240,240,300,300,null,null,50,null,null,null,null,null,null,null,9,null,null,null,null,null,null,9,null,null,null,null,9,10]
[null,"VCT",null,null,null,null,null,null,null,25,null,9,null,null,null,null,70,null,null,null,50,null,70,null,null,185,240,185,185,240,null,300,300,400,400,null,null,70,null,null,null,null,null,null,null,10,null,null,null,null,null,null,10,null,null,null,null,10,11]
[null,null,null,null,null,null,null,null,null,35,null,10,null,null,null,null,95,null,null,null,70,null,95,null,null,240,300,240,240,300,null,400,400,500,null,null,null,95,null,null,null,null,null,null,null,11,null,null,null,null,null,null,11,null,null,null,null,null,12]
[null,null,null,null,null,null,null,null,null,50,null,null,null,null,null,null,120,null,null,null,95,null,120,null,null,300,400,300,300,400,null,500,null,630,null,null,null,120,null,null,null,null,null,null,null,null,null,null,null,null,null,null,12,null,null,null,null,null,13]
[null,null,null,null,null,null,null,null,null,70,null,null,null,null,null,null,150,null,null,null,120,null,150,null,null,400,null,400,400,500,null,630,null,800,null,null,null,150,null,null,null,null,null,null,null,null,null,null,null,null,null,null,null,null,null,null,null,null,14]
[null,null,null,null,null,null,null,null,null,95,null,null,null,null,null,null,185,null,null,null,150,null,185,null,null,500,null,500,null,630,null,800,null,1000,null,null,null,185,null,null,null,null,null,null,null,null,null,null,null,null,null,null,null,null,null,null,null,null,15]
[null,null,null,null,null,null,null,null,null,120,null,null,null,null,null,null,240,null,null,null,185,null,240,null,null,null,null,630,null,800,null,1000,null,null,null,null,null,240,null,null,null,null,null,null,null,null,null,null,null,null,null,null,null,null,null,null,null,null,16]
[null,null,null,null,null,null,null,null,null,150,null,null,null,null,null,null,null,null,null,null,240,null,300,null,null,null,null,800,null,1000,null,null,null,null,null,null,null,300,null,null,null,null,null,null,null,null,null,null,null,null,null,null,null,null,null,null,null,null,17]
[null,null,null,null,null,null,null,null,null,185,null,null,null,null,null,null,null,null,null,null,300,null,400,null,null,null,null,1000,null,null,null,null,null,null,null,null,null,400,null,null,null,null,null,null,null,null,null,null,null,null,null,null,null,null,null,null,null,null,18]
[null,null,null,null,null,null,null,null,null,240,null,null,null,null,null,null,null,null,null,null,400,null,null,null,null,null,null,null,null,null,null,null,null,null,null,null,null,500,null,null,null,null,null,null,null,null,null,null,null,null,null,null,null,null,null,null,null,null,19]
[null,null,null,null,null,null,null,null,null,300,null,null,null,null,null,null,null,null,null,null,500,null,null,null,null,null,null,null,null,null,null,null,null,null,null,null,null,630,null,null,null,null,null,null,null,null,null,null,null,null,null,null,null,null,null,null,null,null,20]
[null,null,null,null,null,null,null,null,null,400,null,null,null,null,null,null,null,null,null,null,null,null,null,null,null,null,null,null,null,null,null,null,null,null,null,null,null,800,null,null,null,null,null,null,null,null,null,null,null,null,null,null,null,null,null,null,null,null,21]
[null,null,null,null,null,null,null,null,null,500,null,null,null,null,null,null,null,null,null,null,null,null,null,null,null,null,null,null,null,null,null,null,null,null,null,null,null,1000,null,null,null,null,null,null,null,null,null,null,null,null,null,null,null,null,null,null,null,null,22]
[null,null,null,null,null,null,null,null,null,630,null,null,null,null,null,null,null,null,null,null,null,null,null,null,null,null,null,null,null,null,null,null,null,null,null,null,null,null,null,null,null,null,null,null,null,null,null,null,null,null,null,null,null,null,null,null,null,null,23]
[null,null,null,null,null,null,null,null,null,800,null,null,null,null,null,null,null,null,null,null,null,null,null,null,null,null,null,null,null,null,null,null,null,null,null,null,null,null,null,null,null,null,null,null,null,null,null,null,null,null,null,null,null,null,null,null,null,null,24]
[null,null,null,null,null,null,null,null,null,1000,null,null,null,null,null,null,null,null,null,null,null,null,null,null,null,null,null,null,null,null,null,null,null,null,null,null,null,null,null,null,null,null,null,null,null,null,null,null,null,null,null,null,null,null,null,null,null,null,25]
[null,null,null,null,null,null,null,null,null,null,null,null,null,null,null,null,null,null,null,null,null,null,null,null,null,null,null,null,null,null,null,null,null,null,null,null,null,null,null,null,null,null,null,null,null,null,null,null,null,null,null,null,null,null,null,null,null,null,26]
[null,null,null,null,null,null,null,null,null,null,null,null,null,null,null,null,null,null,null,null,null,null,null,null,null,null,null,null,null,null,null,null,null,null,null,null,null,null,null,null,null,null,null,null,null,null,null,null,null,null,null,null,null,null,null,null,null,null,27]
[null,null,null,null,null,null,null,null,null,null,null,null,null,null,null,null,null,null,null,null,null,null,null,null,null,null,null,null,null,null,null,null,null,null,null,null,null,null,null,null,null,null,null,null,null,null,null,null,null,null,null,null,null,null,null,null,null,null,28]
[null,null,null,null,null,null,null,null,null,null,null,null,null,null,null,null,null,null,null,null,null,null,null,null,null,null,null,null,null,null,null,null,null,null,null,null,null,null,null,null,null,null,null,null,null,null,null,null,null,null,null,null,null,null,null,null,null,null,29]
[null,null,null,null,null,null,null,null,null,null,null,null,null,null,null,null,null,null,null,null,null,null,null,null,null,null,null,null,null,null,null,null,null,null,null,null,null,null,null,null,null,null,null,null,null,null,null,null,null,null,null,null,null,null,null,null,null,null,30]
[null,null,null,null,null,null,null,null,null,null,null,null,null,null,null,null,null,null,null,null,null,null,null,null,null,null,null,null,null,null,null,null,null,null,null,null,null,null,null,null,null,null,null,null,null,null,null,null,null,null,null,null,null,null,null,null,null,null,31]
[null,null,null,null,null,null,null,null,null,null,null,null,null,null,null,null,null,null,null,null,null,null,null,null,null,null,null,null,null,null,null,null,null,null,null,null,null,null,null,null,null,null,null,null,null,null,null,null,null,null,null,null,null,null,null,null,null,null,32]
[null,null,null,null,null,null,null,null,null,null,null,null,null,null,null,null,null,null,null,null,null,null,null,null,null,null,null,null,null,null,null,null,null,null,null,null,null,null,null,null,null,null,null,null,null,null,null,null,null,null,null,null,null,null,null,null,null,null,33]
[null,null,null,null,null,null,null,null,null,null,null,null,null,null,null,null,null,null,null,null,null,null,null,null,null,null,null,null,null,null,null,null,null,null,null,null,null,null,null,null,null,null,null,null,null,null,null,null,null,null,null,null,null,null,null,null,null,null,34]
[null,null,null,null,null,null,null,null,null,null,null,null,null,null,null,null,null,null,null,null,null,null,null,null,null,null,null,null,null,null,null,null,null,null,null,null,null,null,null,null,null,null,null,null,null,null,null,null,null,null,null,null,null,null,null,null,null,null,35]
[null,null,null,null,null,null,null,null,null,null,null,null,null,null,null,null,null,null,null,null,null,null,null,null,null,null,null,null,null,null,null,null,null,null,null,null,null,null,null,null,null,null,null,null,null,null,null,null,null,null,null,null,null,null,null,null,null,null,36]
[null,null,null,null,null,null,null,null,null,null,null,null,null,null,null,null,null,null,null,null,null,null,null,null,null,null,null,null,null,null,null,null,null,null,null,null,null,null,null,null,null,null,null,null,null,null,null,null,null,null,null,null,null,null,null,null,null,null,37]
[null,null,null,null,null,null,null,null,null,null,null,null,null,null,null,null,null,null,null,null,null,null,null,null,null,null,null,null,null,null,null,null,null,null,null,null,null,null,null,null,null,null,null,null,null,null,null,null,null,null,null,null,null,null,null,null,null,null,38]
[null,null,null,null,null,null,null,null,null,null,null,null,null,null,null,null,null,null,null,null,null,null,null,null,null,null,null,null,null,null,null,null,null,null,null,null,null,null,null,null,null,null,null,null,null,null,null,null,null,null,null,null,null,null,null,null,null,null,39]
[null,null,null,null,null,null,null,null,null,null,null,null,null,null,null,null,null,null,null,null,null,null,null,null,null,null,null,null,null,null,null,null,null,null,null,null,null,null,null,null,null,null,null,null,null,null,null,null,null,null,null,null,null,null,null,null,null,null,40]
[null,null,null,null,null,null,null,null,null,null,null,null,null,null,null,null,null,null,null,null,null,null,null,null,null,null,null,null,null,null,null,null,null,null,null,null,null,null,null,null,null,null,null,null,null,null,null,null,null,null,null,null,null,null,null,null,null,null,41]
[null,null,null,null,null,null,null,null,null,null,null,null,null,null,null,null,null,null,null,null,null,null,null,null,null,null,null,null,null,null,null,null,null,null,null,null,null,null,null,null,null,null,null,null,null,null,null,null,null,null,null,null,null,null,null,null,null,null,42]
[null,null,null,null,null,null,null,null,null,null,null,null,null,null,null,null,null,null,null,null,null,null,null,null,null,null,null,null,null,null,null,null,null,null,null,null,null,null,null,null,null,null,null,null,null,null,null,null,null,null,null,null,null,null,null,null,null,null,43]
[null,null,null,null,null,null,null,null,null,null,null,null,null,null,null,null,null,null,null,null,null,null,null,null,null,null,null,null,null,null,null,null,null,null,null,null,null,null,null,null,null,null,null,null,null,null,null,null,null,null,null,null,null,null,null,null,null,null,44]
[null,null,null,null,null,null,null,null,null,null,null,null,null,null,null,null,null,null,null,null,null,null,null,null,null,null,null,null,null,null,null,null,null,null,null,null,null,null,null,null,null,null,null,null,null,null,null,null,null,null,null,null,null,null,null,null,null,null,45]
[null,null,null,null,null,null,null,null,null,null,null,null,null,null,null,null,null,null,null,null,null,null,null,null,null,null,null,null,null,null,null,null,null,null,null,null,null,null,null,null,null,null,null,null,null,null,null,null,null,null,null,null,null,null,null,null,null,null,46]
[null,null,null,null,null,null,null,null,null,null,null,null,null,null,null,null,null,null,null,null,null,null,null,null,null,null,null,null,null,null,null,null,null,null,null,null,null,null,null,null,null,null,null,null,null,null,null,null,null,null,null,null,null,null,null,null,null,null,47]
[null,null,null,null,null,null,null,null,null,null,null,null,null,null,null,null,null,null,null,null,null,null,null,null,null,null,null,null,null,null,null,null,null,null,null,null,null,null,null,null,null,null,null,null,null,null,null,null,null,null,null,null,null,null,null,null,null,null,48]

{"sheet":"Rdc","index":6,"n_rows":68,"n_cols":11,"rows_kept":68,"cut":false,"hidden":true,"merged":[]}
[]
[]
[null,"Rdc"]
[]
[null,null,"CU strand",null,"Flex",null,"Alu Strand",null,{"$f":"D!H53","v":"CU"},"R use",{"$f":"IF(I5=\"CU\",C31,IF(I5=\"CU Flex\",E31,IF(I5=\"AL\",G31,\"\")))","v":0.124}]
[null,null,0.5,36,0.5,39,null,null,null,null,""]
[null,null,0.75,24.5,0.75,26,null,null,null,null,""]
[null,null,1,18.100000000000001,1,19.5,null,null,null,null,""]
[null,null,1.5,12.1,1.5,13.3,null,null,null,null,""]
[null,null,2.5,7.41,2.5,7.98,null,null,null,null,""]
[null,null,4,4.6100000000000003,4,4.95,null,null,null,null,""]
[null,null,6,3.08,6,3.3,null,null,null,null,""]
[null,null,10,1.83,10,1.91,10,3.08,null,null,""]
[null,null,16,1.1499999999999999,16,1.21,16,1.91,null,null,""]
[null,null,25,0.72699999999999998,25,0.78,25,1.2,null,null,""]
[null,null,35,0.52400000000000002,35,0.55400000000000005,35,0.86799999999999999,null,null,""]
[null,null,50,0.38700000000000001,50,0.38600000000000001,50,0.64100000000000001,null,null,""]
[null,null,70,0.26800000000000002,70,0.27200000000000002,70,0.443,null,null,""]
[null,null,95,0.193,95,0.20599999999999999,95,0.32,null,null,""]
[null,null,120,0.153,120,0.161,120,0.253,null,null,""]
[null,null,150,0.124,150,0.129,150,0.20599999999999999,null,null,""]
[null,null,185,9.9099999999999994E-2,185,0.106,185,0.16400000000000001,null,null,""]
[null,null,240,7.5399999999999995E-2,240,8.0100000000000005E-2,240,0.125,null,null,""]
[null,null,300,6.0100000000000001E-2,300,6.4100000000000004E-2,300,0.1,null,null,""]
[null,null,400,4.7E-2,400,4.8599999999999997E-2,400,7.7799999999999994E-2,null,null,""]
[null,null,500,3.6600000000000001E-2,500,3.8399999999999997E-2,500,6.0499999999999998E-2,null,null,""]
[null,null,630,2.8299999999999999E-2,630,2.87E-2,630,4.6899999999999997E-2,null,null,""]
[null,null,800,2.2100000000000002E-2,null,null,800,3.6700000000000003E-2,null,null,""]
[null,null,1000,1.7600000000000001E-2,null,null,1000,2.9100000000000001E-2,null,null,""]
[]
["Size",{"$f":"D!F38","v":150},{"$f":"IF(B31=C6,D6,IF(B31=C7,D7,IF(B31=C8,D8,IF(B31=C9,D9,IF(B31=C10,D10,IF(B31=C11,D11,IF(B31=C12,D12,IF(B31=C13,D13,IF(B31=C14,D14,IF(B31=C15,D15,IF(B31=C16,D16,IF(B31=C17,D17,IF(B31=C18,D18,IF(B31=C19,D19,IF(B31=C20,D20,IF(B31=C21,D21,IF(B31=C22,D22,IF(B31=C23,D23,IF(B31=C24,D24,IF(B31=C25,D25,IF(B31=C26,D26,IF(B31=C27,D27,IF(B31=C28,D28,IF(B31=C29,D29,\"\"))))))))))))))))))))))))","v":0.124},{"$f":"B31","v":150},{"$f":"IF(D31=E6,F6,IF(D31=E7,F7,IF(D31=E8,F8,IF(D31=E9,F9,IF(D31=E10,F10,IF(D31=E11,F11,IF(D31=E12,F12,IF(D31=E13,F13,IF(D31=E14,F14,IF(D31=E15,F15,IF(D31=E16,F16,IF(D31=E17,F17,IF(D31=E18,F18,IF(D31=E19,F19,IF(D31=E20,F20,IF(D31=E21,F21,IF(D31=E22,F22,IF(D31=E23,F23,IF(D31=E24,F24,IF(D31=E25,F25,IF(D31=E26,F26,IF(D31=E27,F27,IF(D31=E28,F28,IF(D31=E29,F29,\"\"))))))))))))))))))))))))","v":0.129},{"$f":"B31","v":150},{"$f":"IF(F31=G6,H6,IF(F31=G7,H7,IF(F31=G8,H8,IF(F31=G9,H9,IF(F31=G10,H10,IF(F31=G11,H11,IF(F31=G12,H12,IF(F31=G13,H13,IF(F31=G14,H14,IF(F31=G15,H15,IF(F31=G16,H16,IF(F31=G17,H17,IF(F31=G18,H18,IF(F31=G19,H19,IF(F31=G20,H20,IF(F31=G21,H21,IF(F31=G22,H22,IF(F31=G23,H23,IF(F31=G24,H24,IF(F31=G25,H25,IF(F31=G26,H26,IF(F31=G27,H27,IF(F31=G28,H28,IF(F31=G29,H29,\"\"))))))))))))))))))))))))","v":0.20599999999999999}]
[]
[]
[]
[]
[]
[]
[]
[]
[null,"Rdc"]
[]
[null,null,"CU strand",null,"Flex",null,"Alu Strand",null,{"$f":"Interface!#REF!","v":{"$error":"#REF!"}},"R use",{"$f":"IF(I42=\"CU\",C68,IF(I42=\"CU Flex\",E68,IF(I42=\"Aluminium\",G68,\"\")))","v":{"$error":"#REF!"}}]
[null,null,0.5,36,0.5,39,null,null,null,null,""]
[null,null,0.75,24.5,0.75,26,null,null,null,null,""]
[null,null,1,18.100000000000001,1,19.5,null,null,null,null,""]
[null,null,1.5,12.1,1.5,13.3,null,null,null,null,""]
[null,null,2.5,7.41,2.5,7.98,null,null,null,null,""]
[null,null,4,4.6100000000000003,4,4.95,null,null,null,null,""]
[null,null,6,3.08,6,3.3,null,null,null,null,""]
[null,null,10,1.83,10,1.91,10,3.08,null,null,""]
[null,null,16,1.1499999999999999,16,1.21,16,1.91,null,null,""]
[null,null,25,0.72699999999999998,25,0.78,25,1.2,null,null,""]
[null,null,35,0.52400000000000002,35,0.55400000000000005,35,0.86799999999999999,null,null,""]
[null,null,50,0.38700000000000001,50,0.38600000000000001,50,0.64100000000000001,null,null,""]
[null,null,70,0.26800000000000002,70,0.27200000000000002,70,0.443,null,null,""]
[null,null,95,0.193,95,0.20599999999999999,95,0.32,null,null,""]
[null,null,120,0.153,120,0.161,120,0.253,null,null,""]
[null,null,150,0.124,150,0.129,150,0.20599999999999999,null,null,""]
[null,null,185,9.9099999999999994E-2,185,0.106,185,0.16400000000000001,null,null,""]
[null,null,240,7.5399999999999995E-2,240,8.0100000000000005E-2,240,0.125,null,null,""]
[null,null,300,6.0100000000000001E-2,300,6.4100000000000004E-2,300,0.1,null,null,""]
[null,null,400,4.7E-2,400,4.8599999999999997E-2,400,7.7799999999999994E-2,null,null,""]
[null,null,500,3.6600000000000001E-2,500,3.8399999999999997E-2,500,6.0499999999999998E-2,null,null,""]
[null,null,630,2.8299999999999999E-2,630,2.87E-2,630,4.6899999999999997E-2,null,null,""]
[null,null,800,2.2100000000000002E-2,null,null,800,3.6700000000000003E-2,null,null,""]
[null,null,1000,1.7600000000000001E-2,null,null,1000,2.9100000000000001E-2,null,null,""]
[]
["Size",{"$f":"Interface!#REF!","v":{"$error":"#REF!"}},{"$f":"IF(B68=C43,D43,IF(B68=C44,D44,IF(B68=C45,D45,IF(B68=C46,D46,IF(B68=C47,D47,IF(B68=C48,D48,IF(B68=C49,D49,IF(B68=C50,D50,IF(B68=C51,D51,IF(B68=C52,D52,IF(B68=C53,D53,IF(B68=C54,D54,IF(B68=C55,D55,IF(B68=C56,D56,IF(B68=C57,D57,IF(B68=C58,D58,IF(B68=C59,D59,IF(B68=C60,D60,IF(B68=C61,D61,IF(B68=C62,D62,IF(B68=C63,D63,IF(B68=C64,D64,IF(B68=C65,D65,IF(B68=C66,D66,\"\"))))))))))))))))))))))))","v":{"$error":"#REF!"}},{"$f":"B68","v":{"$error":"#REF!"}},{"$f":"IF(D68=E43,F43,IF(D68=E44,F44,IF(D68=E45,F45,IF(D68=E46,F46,IF(D68=E47,F47,IF(D68=E48,F48,IF(D68=E49,F49,IF(D68=E50,F50,IF(D68=E51,F51,IF(D68=E52,F52,IF(D68=E53,F53,IF(D68=E54,F54,IF(D68=E55,F55,IF(D68=E56,F56,IF(D68=E57,F57,IF(D68=E58,F58,IF(D68=E59,F59,IF(D68=E60,F60,IF(D68=E61,F61,IF(D68=E62,F62,IF(D68=E63,F63,IF(D68=E64,F64,IF(D68=E65,F65,IF(D68=E66,F66,\"\"))))))))))))))))))))))))","v":{"$error":"#REF!"}},{"$f":"B68","v":{"$error":"#REF!"}},{"$f":"IF(F68=G43,H43,IF(F68=G44,H44,IF(F68=G45,H45,IF(F68=G46,H46,IF(F68=G47,H47,IF(F68=G48,H48,IF(F68=G49,H49,IF(F68=G50,H50,IF(F68=G51,H51,IF(F68=G52,H52,IF(F68=G53,H53,IF(F68=G54,H54,IF(F68=G55,H55,IF(F68=G56,H56,IF(F68=G57,H57,IF(F68=G58,H58,IF(F68=G59,H59,IF(F68=G60,H60,IF(F68=G61,H61,IF(F68=G62,H62,IF(F68=G63,H63,IF(F68=G64,H64,IF(F68=G65,H65,IF(F68=G66,H66,\"\"))))))))))))))))))))))))","v":{"$error":"#REF!"}}]

{"sheet":"Sheet1","index":7,"n_rows":51,"n_cols":412,"rows_kept":51,"cut":false,"hidden":true,"merged":[[1,111,1,117],[1,118,1,124],[1,126,1,132],[2,26,3,26],[2,27,3,27],[2,129,3,129],[2,94,3,94],[2,38,3,38],[2,62,3,62],[2,79,3,79],[2,47,3,47],[2,32,3,32],[2,33,3,33],[2,34,3,34],[2,35,3,35],[2,36,3,36],[2,37,3,37],[2,39,3,39],[1,103,1,109],[1,48,1,54],[1,55,1,61],[2,49,3,49],[2,50,3,50],[2,51,3,51],[2,151,3,151],[2,152,3,152],[2,153,3,153],[2,154,3,154],[2,17,3,17],[2,2,3,2],[2,128,3,128],[2,18,3,18],[2,19,3,19],[2,20,3,20],[2,103,3,103],[2,104,3,104],[2,105,3,105],[2,106,3,106],[2,107,3,107],[2,108,3,108],[2,109,3,109],[2,43,3,43],[2,44,3,44],[2,45,3,45],[2,46,3,46],[2,48,3,48],[2,146,3,146],[2,147,3,147],[2,262,3,262],[2,247,3,247],[2,232,3,232],[2,217,3,217],[2,307,3,307],[2,322,3,322],[2,292,3,292],[2,367,3,367],[2,337,3,337],[2,352,3,352],[2,277,3,277],[2,365,3,365],[2,366,3,366],[2,356,3,356],[2,357,3,357],[2,358,3,358],[2,359,3,359],[2,360,3,360],[2,361,3,361],[2,362,3,362],[2,363,3,363],[2,364,3,364],[2,353,3,353],[2,354,3,354],[2,148,3,148],[2,149,3,149],[2,160,3,160],[1,133,1,139],[2,119,3,119],[2,120,3,120],[2,121,3,121],[2,122,3,122],[2,123,3,123],[2,124,3,124],[2,131,3,131],[2,132,3,132],[2,133,3,133],[2,134,3,134],[2,135,3,135],[2,137,3,137],[2,138,3,138],[2,136,3,136],[2,130,3,130],[2,139,3,139],[2,159,3,159],[2,150,3,150],[1,141,1,147],[1,148,1,154],[2,115,3,115],[2,116,3,116],[2,117,3,117],[2,126,3,126],[2,110,3,110],[2,114,3,114],[2,127,3,127],[2,118,3,118],[2,145,3,145],[2,202,3,202],[2,141,3,141],[2,142,3,142],[2,143,3,143],[2,144,3,144],[1,156,1,162],[1,163,1,169],[2,163,3,163],[2,164,3,164],[2,165,3,165],[2,166,3,166],[2,167,3,167],[1,171,1,177],[2,171,3,171],[2,172,3,172],[2,173,3,173],[2,174,3,174],[2,175,3,175],[2,176,3,176],[2,177,3,177],[2,179,3,179],[2,169,3,169],[2,182,3,182],[2,183,3,183],[1,18,1,24],[1,25,1,31],[2,21,3,21],[2,22,3,22],[2,23,3,23],[2,24,3,24],[2,25,3,25],[2,96,3,96],[2,97,3,97],[2,93,3,93],[2,91,3,91],[2,92,3,92],[2,88,3,88],[2,89,3,89],[2,90,3,90],[2,28,3,28],[2,29,3,29],[2,30,3,30],[2,31,3,31],[1,33,1,39],[1,40,1,46],[2,40,3,40],[2,41,3,41],[2,42,3,42],[1,3,1,9],[1,10,1,16],[2,3,3,3],[2,4,3,4],[2,5,3,5],[2,6,3,6],[2,7,3,7],[2,8,3,8],[2,9,3,9],[2,10,3,10],[2,11,3,11],[2,12,3,12],[2,13,3,13],[2,14,3,14],[2,15,3,15],[2,16,3,16],[2,52,3,52],[2,53,3,53],[2,54,3,54],[2,55,3,55],[2,56,3,56],[2,57,3,57],[2,58,3,58],[2,59,3,59],[2,60,3,60],[2,61,3,61],[1,95,1,102],[2,102,3,102],[2,63,3,63],[2,64,3,64],[2,65,3,65],[2,66,3,66],[2,67,3,67],[2,68,3,68],[2,69,3,69],[2,71,3,71],[2,72,3,72],[2,73,3,73],[2,74,3,74],[2,75,3,75],[2,76,3,76],[2,77,3,77],[2,70,3,70],[2,87,3,87],[1,80,1,86],[1,87,1,93],[2,86,3,86],[2,80,3,80],[2,81,3,81],[2,82,3,82],[2,83,3,83],[2,84,3,84],[2,85,3,85],[2,100,3,100],[2,180,3,180],[2,181,3,181],[2,101,3,101],[2,98,3,98],[2,99,3,99],[2,95,3,95],[2,170,3,170],[2,111,3,111],[2,112,3,112],[2,113,3,113],[2,161,3,161],[2,162,3,162],[2,140,3,140],[2,155,3,155],[2,156,3,156],[2,157,3,157],[2,158,3,158],[2,168,3,168],[2,125,3,125],[2,184,3,184],[2,185,3,185],[1,188,1,194],[1,195,1,201],[2,188,3,188],[2,189,3,189],[2,190,3,190],[2,191,3,191],[2,192,3,192],[2,193,3,193],[2,194,3,194],[2,195,3,195],[2,196,3,196],[2,197,3,197],[2,198,3,198],[2,199,3,199],[2,200,3,200],[2,201,3,201],[2,187,3,187],[1,203,1,209],[1,210,1,216],[2,203,3,203],[2,204,3,204],[2,205,3,205],[2,206,3,206],[2,207,3,207],[2,208,3,208],[2,209,3,209],[2,210,3,210],[2,211,3,211],[2,212,3,212],[2,213,3,213],[2,214,3,214],[2,215,3,215],[2,216,3,216],[1,218,1,224],[1,225,1,231],[2,218,3,218],[2,219,3,219],[2,220,3,220],[2,221,3,221],[2,222,3,222],[2,223,3,223],[2,224,3,224],[2,225,3,225],[2,226,3,226],[2,227,3,227],[2,228,3,228],[2,229,3,229],[2,230,3,230],[2,231,3,231],[1,233,1,239],[1,240,1,246],[2,233,3,233],[2,234,3,234],[2,235,3,235],[2,236,3,236],[2,237,3,237],[2,238,3,238],[2,239,3,239],[2,240,3,240],[2,241,3,241],[2,242,3,242],[2,243,3,243],[2,244,3,244],[2,245,3,245],[2,246,3,246],[1,248,1,254],[1,255,1,261],[2,248,3,248],[2,249,3,249],[2,250,3,250],[2,251,3,251],[2,252,3,252],[2,253,3,253],[2,254,3,254],[2,255,3,255],[2,256,3,256],[2,257,3,257],[2,258,3,258],[2,259,3,259],[2,260,3,260],[2,261,3,261],[1,263,1,269],[1,270,1,276],[2,263,3,263],[2,264,3,264],[2,265,3,265],[2,266,3,266],[2,267,3,267],[2,268,3,268],[2,269,3,269],[2,270,3,270],[2,271,3,271],[2,272,3,272],[2,273,3,273],[2,274,3,274],[2,275,3,275],[2,276,3,276],[1,278,1,284],[1,285,1,291],[2,278,3,278],[2,279,3,279],[2,280,3,280],[2,281,3,281],[2,282,3,282],[2,283,3,283],[2,284,3,284],[2,285,3,285],[2,286,3,286],[2,287,3,287],[2,288,3,288],[2,289,3,289],[2,290,3,290],[2,291,3,291],[1,293,1,299],[1,300,1,306],[2,293,3,293],[2,294,3,294],[2,295,3,295],[2,296,3,296],[2,297,3,297],[2,298,3,298],[2,299,3,299],[2,300,3,300],[2,301,3,301],[2,302,3,302],[2,303,3,303],[2,304,3,304],[2,305,3,305],[2,306,3,306],[1,308,1,314],[1,315,1,321],[2,308,3,308],[2,309,3,309],[2,310,3,310],[2,311,3,311],[2,312,3,312],[2,313,3,313],[2,314,3,314],[2,315,3,315],[2,316,3,316],[2,317,3,317],[2,318,3,318],[2,319,3,319],[2,320,3,320],[2,321,3,321],[1,323,1,329],[1,330,1,336],[2,323,3,323],[2,324,3,324],[2,325,3,325],[2,326,3,326],[2,327,3,327],[2,328,3,328],[2,329,3,329],[2,330,3,330],[2,331,3,331],[2,332,3,332],[2,333,3,333],[2,334,3,334],[2,335,3,335],[2,336,3,336],[2,355,3,355],[1,338,1,344],[1,345,1,351],[2,338,3,338],[2,339,3,339],[2,340,3,340],[2,341,3,341],[2,342,3,342],[2,343,3,343],[2,344,3,344],[2,345,3,345],[2,346,3,346],[2,347,3,347],[2,348,3,348],[2,349,3,349],[2,350,3,350],[2,351,3,351],[1,63,1,70],[1,71,1,78],[2,78,3,78],[2,178,3,178],[1,179,1,186],[2,186,3,186],[1,368,1,374],[1,375,1,381],[2,368,3,368],[2,369,3,369],[2,370,3,370],[2,371,3,371],[2,372,3,372],[2,373,3,373],[2,374,3,374],[2,375,3,375],[2,376,3,376],[2,377,3,377],[2,378,3,378],[2,379,3,379],[2,380,3,380],[2,381,3,381],[1,353,1,359],[1,360,1,366],[1,383,1,389],[1,390,1,396],[2,382,3,382],[2,383,3,383],[2,384,3,384],[2,385,3,385],[2,386,3,386],[2,387,3,387],[2,388,3,388],[2,389,3,389],[2,390,3,390],[2,391,3,391],[2,392,3,392],[2,393,3,393],[2,394,3,394],[2,395,3,395],[2,396,3,396],[1,398,1,404],[1,405,1,411],[2,397,3,397],[2,398,3,398],[2,399,3,399],[2,400,3,400],[2,401,3,401],[2,402,3,402],[2,403,3,403],[2,404,3,404],[2,405,3,405],[2,406,3,406],[2,407,3,407],[2,408,3,408],[2,409,3,409],[2,410,3,410],[2,411,3,411]]}
[]
[null,null,null,"Air",null,null,null,null,null,null,"Ground",null,null,null,null,null,null,null,"Air",null,null,null,null,null,null,"Ground",null,null,null,null,null,null,null,"Air",null,null,null,null,null,null,"Ground",null,null,null,null,null,null,null,"Air",null,null,null,null,null,null,"Ground",null,null,null,null,null,null,null,"Air",null,null,null,null,null,null,null,"Ground",null,null,null,null,null,null,null,null,"Air",null,null,null,null,null,null,"Ground",null,null,null,null,null,null,null,"Air",null,null,null,null,null,null,null,"Ground",null,null,null,null,null,null,null,"Air",null,null,null,null,null,null,"Ground",null,null,null,null,null,null,null,"Air",null,null,null,null,null,null,"Ground",null,null,null,null,null,null,null,"Air",null,null,null,null,null,null,"Ground",null,null,null,null,null,null,null,"Air",null,null,null,null,null,null,"Ground",null,null,null,null,null,null,null,"Air",null,null,null,null,null,null,null,"Ground",null,null,null,null,null,null,null,null,"Air",null,null,null,null,null,null,"Ground",null,null,null,null,null,null,null,"Air",null,null,null,null,null,null,"Ground",null,null,null,null,null,null,null,"Air",null,null,null,null,null,null,"Ground",null,null,null,null,null,null,null,"Air",null,null,null,null,null,null,"Ground",null,null,null,null,null,null,null,"Air",null,null,null,null,null,null,"Ground",null,null,null,null,null,null,null,"Air",null,null,null,null,null,null,"Ground",null,null,null,null,null,null,null,"Air",null,null,null,null,null,null,"Ground",null,null,null,null,null,null,null,"Air",null,null,null,null,null,null,"Ground",null,null,null,null,null,null,null,"Air",null,null,null,null,null,null,"Ground",null,null,null,null,null,null,null,"Air",null,null,null,null,null,null,"Ground",null,null,null,null,null,null,null,"Air",null,null,null,null,null,null,"Ground",null,null,null,null,null,null,null,"Air",null,null,null,null,null,null,"Ground",null,null,null,null,null,null,null,"Air",null,null,null,null,null,null,"Ground",null,null,null,null,null,null,null,"Air",null,null,null,null,null,null,"Ground",null,null,null,null,null,null,null,"Air",null,null,null,null,null,null,"Ground"]
[null,null,"60227 IEC 01 THW","Touching2","Touching3","Trefoil","Spacing",2,3,4,"Touching2","Touching3","Trefoil","Spacing",2,3,4,"60227 IEC 01 THW (f)","Touching2","Touching3","Trefoil","Spacing",2,3,4,"Touching2","Touching3","Trefoil","Spacing",2,3,4,"60227 IEC 05 IV","Touching2","Touching3","Trefoil","Spacing",2,3,4,"Touching2","Touching3","Trefoil","Spacing",2,3,4,"60227 IEC 06 IV (f)","Touching2","Touching3","Trefoil","Spacing",2,3,4,"Touching2","Touching3","Trefoil","Spacing",2,3,4,"60227 IEC 10 ","Touching2","Touching3","Trefoil","Spacing",2,3,4,5,"Touching2","Touching3","Trefoil","Spacing",2,3,4,5,"60227 IEC 52 VCT","Touching2","Touching3","Trefoil","Spacing",2,3,4,"Touching2","Touching3","Trefoil","Spacing",2,3,4,"60227 IEC 53 VCT","Touching2","Touching3","Trefoil","Spacing",2,3,4,5,"Touching2","Touching3","Trefoil","Spacing",2,3,4,"NYY","Touching2","Touching3","Trefoil","Spacing",2,3,4,"Touching2","Touching3","Trefoil","Spacing",2,3,4,"VCT","Touching2","Touching3","Trefoil","Spacing",2,3,4,"Touching2","Touching3","Trefoil","Spacing",2,3,4,"NYY-SWA","Touching2","Touching3","Trefoil","Spacing",2,3,4,"Touching2","Touching3","Trefoil","Spacing",2,3,4,"FD-0.6/1KV-CV","Touching2","Touching3","Trefoil","Spacing",2,3,4,"Touching2","Touching3","Trefoil","Spacing",2,3,4,"FD-0.6/1KV-CV-SWA","Touching2","Touching3","Trefoil","Spacing",2,3,4,5,"Touching2","Touching3","Trefoil","Spacing",2,3,4,5,"1.8/3KV-CV","Touching2","Touching3","Trefoil","Spacing",2,3,4,"Touching2","Touching3","Trefoil","Spacing",2,3,4,"3.6/6KV-CV","Touching2","Touching3","Trefoil","Spacing",2,3,4,"Touching2","Touching3","Trefoil","Spacing",2,3,4,"6/10KV-CV","Touching2","Touching3","Trefoil","Spacing",2,3,4,"Touching2","Touching3","Trefoil","Spacing",2,3,4,"8.7/15KV-CV","Touching2","Touching3","Trefoil","Spacing",2,3,4,"Touching2","Touching3","Trefoil","Spacing",2,3,4,"12/20KV-CV","Touching2","Touching3","Trefoil","Spacing",2,3,4,"Touching2","Touching3","Trefoil","Spacing",2,3,4,"18/30KV-CV","Touching2","Touching3","Trefoil","Spacing",2,3,4,"Touching2","Touching3","Trefoil","Spacing",2,3,4,"THWA","Touching2","Touching3","Trefoil","Spacing",2,3,4,"Touching2","Touching3","Trefoil","Spacing",2,3,4,"115KV-CE","Touching2","Touching3","Trefoil","Spacing",2,3,4,"Touching2","Touching3","Trefoil","Spacing",2,3,4,"THWA","Touching2","Touching3","Trefoil","Spacing",2,3,4,"Touching2","Touching3","Trefoil","Spacing",2,3,4,"THWA-C","Touching2","Touching3","Trefoil","Spacing",2,3,4,"Touching2","Touching3","Trefoil","Spacing",2,3,4,"15KV-CC","Touching2","Touching3","Trefoil","Spacing",2,3,4,"Touching2","Touching3","Trefoil","Spacing",2,3,4,"25KV-CC","Touching2","Touching3","Trefoil","Spacing",2,3,4,"Touching2","Touching3","Trefoil","Spacing",2,3,4,"35KV-CC","Touching2","Touching3","Trefoil","Spacing",2,3,4,"Touching2","Touching3","Trefoil","Spacing",2,3,4,"FD-0.6/1KV-AL-CV","Touching2","Touching3","Trefoil","Spacing",2,3,4,"Touching2","Touching3","Trefoil","Spacing",2,3,4,"CVV","Touching2","Touching3","Trefoil","Spacing",2,3,4,"Touching2","Touching3","Trefoil","Spacing",2,3,4]
[]
[null,1,0.5,null,null,null,null,null,null,null,null,null,null,null,null,null,null,0.5,null,null,null,null,null,null,null,null,null,null,null,null,null,null,0.5,8,7,7,11,null,null,null,null,null,null,null,null,null,null,0.5,9,7,7,11,null,null,null,null,null,null,null,null,null,null,0.5,null,null,null,null,null,null,null,null,null,null,null,null,null,null,null,null,0.5,null,null,null,null,9,8,null,null,null,null,null,null,null,null,0.5,null,null,null,null,12,10,10,10,null,null,null,null,null,null,null,0.5,null,null,null,null,null,null,null,null,null,null,null,null,null,null,0.5,null,null,null,null,null,null,null,null,null,null,null,null,null,null,0.5,null,null,null,null,null,null,null,null,null,null,null,null,null,null,0.5,null,null,null,null,null,null,null,null,null,null,null,null,null,null,0.5,null,null,null,null,null,null,null,null,null,null,null,null,null,null,null,null,0.5,null,null,null,null,null,null,null,null,null,null,null,null,null,null,0.5,null,null,null,null,null,null,null,null,null,null,null,null,null,null,0.5,null,null,null,null,null,null,null,null,null,null,null,null,null,null,0.5,null,null,null,null,null,null,null,null,null,null,null,null,null,null,0.5,null,null,null,null,null,null,null,null,null,null,null,null,null,null,0.5,null,null,null,null,null,null,null,null,null,null,null,null,null,null,0.5,null,null,null,null,null,null,null,null,null,null,null,null,null,null,0.5,null,null,null,null,null,null,null,null,null,null,null,null,null,null,0.5,null,null,null,null,null,null,null,null,null,null,null,null,null,null,0.5,null,null,null,null,null,null,null,null,null,null,null,null,null,null,0.5,null,null,null,null,null,null,null,null,null,null,null,null,null,null,0.5,null,null,null,null,null,null,null,null,null,null,null,null,null,null,0.5,null,null,null,null,null,null,null,null,null,null,null,null,null,null,0.5,null,null,null,null,null,null,null,null,null,null,null,null,null,null,0.5,null,null,null,null,12,10,10]
[null,2,0.75,null,null,null,null,null,null,null,null,null,null,null,null,null,null,0.75,null,null,null,null,null,null,null,null,null,null,null,null,null,null,0.75,10,9,8,14,null,null,null,null,null,null,null,null,null,null,0.75,10,9,9,14,null,null,null,null,null,null,null,null,null,null,0.75,null,null,null,null,null,null,null,null,null,null,null,null,null,null,null,null,0.75,null,null,null,null,12,10,null,null,null,null,null,null,null,null,0.75,null,null,null,null,14,12,12,12,null,null,null,null,null,null,null,0.75,null,null,null,null,null,null,null,null,null,null,null,null,null,null,0.75,null,null,null,null,null,null,null,null,null,null,null,null,null,null,0.75,null,null,null,null,null,null,null,null,null,null,null,null,null,null,0.75,null,null,null,null,null,null,null,null,null,null,null,null,null,null,0.75,null,null,null,null,null,null,null,null,null,null,null,null,null,null,null,null,0.75,null,null,null,null,null,null,null,null,null,null,null,null,null,null,0.75,null,null,null,null,null,null,null,null,null,null,null,null,null,null,0.75,null,null,null,null,null,null,null,null,null,null,null,null,null,null,0.75,null,null,null,null,null,null,null,null,null,null,null,null,null,null,0.75,null,null,null,null,null,null,null,null,null,null,null,null,null,null,0.75,null,null,null,null,null,null,null,null,null,null,null,null,null,null,0.75,null,null,null,null,null,null,null,null,null,null,null,null,null,null,0.75,null,null,null,null,null,null,null,null,null,null,null,null,null,null,0.75,null,null,null,null,null,null,null,null,null,null,null,null,null,null,0.75,null,null,null,null,null,null,null,null,null,null,null,null,null,null,0.75,null,null,null,null,null,null,null,null,null,null,null,null,null,null,0.75,null,null,null,null,null,null,null,null,null,null,null,null,null,null,0.75,null,null,null,null,null,null,null,null,null,null,null,null,null,null,0.75,null,null,null,null,null,null,null,null,null,null,null,null,null,null,0.75,null,null,null,null,15,13,13]
[null,3,1,null,null,null,null,null,null,null,null,null,null,null,null,null,null,1,null,null,null,null,null,null,null,null,null,null,null,null,null,null,1,13,11,10,16,null,null,null,null,null,null,null,null,null,null,1,12,11,10,16,null,null,null,null,null,null,null,null,null,null,1,null,null,null,null,null,null,null,null,null,null,null,null,null,null,null,null,1,null,null,null,null,null,null,null,null,null,null,null,null,null,null,1,null,null,null,null,18,15,15,15,null,null,null,null,null,null,null,1,16,16,15,19,null,null,null,27,27,20,27,null,null,null,1,null,null,null,null,null,null,null,null,null,null,null,null,null,null,1,null,null,null,null,16,14,14,null,null,null,null,21,18,18,1,null,null,null,null,null,null,null,null,null,null,null,null,null,null,1,null,null,null,null,null,null,null,null,null,null,null,null,null,null,null,null,1,null,null,null,null,null,null,null,null,null,null,null,null,null,null,1,null,null,null,null,null,null,null,null,null,null,null,null,null,null,1,null,null,null,null,null,null,null,null,null,null,null,null,null,null,1,null,null,null,null,null,null,null,null,null,null,null,null,null,null,1,null,null,null,null,null,null,null,null,null,null,null,null,null,null,1,null,null,null,null,null,null,null,null,null,null,null,null,null,null,1,null,null,null,null,null,null,null,null,null,null,null,null,null,null,1,null,null,null,null,null,null,null,null,null,null,null,null,null,null,1,null,null,null,null,null,null,null,null,null,null,null,null,null,null,1,null,null,null,null,null,null,null,null,null,null,null,null,null,null,1,null,null,null,null,null,null,null,null,null,null,null,null,null,null,1,null,null,null,null,null,null,null,null,null,null,null,null,null,null,1,null,null,null,null,null,null,null,null,null,null,null,null,null,null,1,null,null,null,null,null,null,null,null,null,null,null,null,null,null,1,null,null,null,null,17,15,15]
[null,4,1.5,16,14,14,21,null,null,null,null,null,null,null,null,null,null,1.5,16,14,13,20,null,null,null,null,null,null,null,null,null,null,1.5,null,null,null,null,null,null,null,null,null,null,null,null,null,null,1.5,null,null,null,null,null,null,null,null,null,null,null,null,null,null,1.5,null,null,null,null,19,16,16,16,null,null,null,null,null,null,null,null,1.5,null,null,null,null,null,null,null,null,null,null,null,null,null,null,1.5,null,null,null,null,25,21,21,21,null,null,null,null,null,null,null,1.5,20,19,19,24,null,null,null,33,33,24,33,null,null,null,1.5,null,null,null,null,null,null,null,null,null,null,null,null,null,null,1.5,null,null,null,null,20,17,17,null,null,null,null,27,23,23,1.5,26,24,23,31,26,22,22,44,44,30,44,33,28,28,1.5,null,null,null,null,28,24,24,24,null,null,null,null,33,28,28,28,1.5,null,null,null,null,null,null,null,null,null,null,null,null,null,null,1.5,null,null,null,null,null,null,null,null,null,null,null,null,null,null,1.5,null,null,null,null,null,null,null,null,null,null,null,null,null,null,1.5,null,null,null,null,null,null,null,null,null,null,null,null,null,null,1.5,null,null,null,null,null,null,null,null,null,null,null,null,null,null,1.5,null,null,null,null,null,null,null,null,null,null,null,null,null,null,1.5,null,null,null,null,null,null,null,null,null,null,null,null,null,null,1.5,null,null,null,null,null,null,null,null,null,null,null,null,null,null,1.5,null,null,null,null,null,null,null,null,null,null,null,null,null,null,1.5,null,null,null,null,null,null,null,null,null,null,null,null,null,null,1.5,null,null,null,null,null,null,null,null,null,null,null,null,null,null,1.5,null,null,null,null,null,null,null,null,null,null,null,null,null,null,1.5,null,null,null,null,null,null,null,null,null,null,null,null,null,null,1.5,null,null,null,null,null,null,null,null,null,null,null,null,null,null,1.5,null,null,null,null,22,19,19]
[null,5,2.5,22,20,19,28,null,null,null,null,null,null,null,null,null,null,2.5,22,19,19,28,null,null,null,null,null,null,null,null,null,null,2.5,null,null,null,null,null,null,null,null,null,null,null,null,null,null,2.5,null,null,null,null,null,null,null,null,null,null,null,null,null,null,2.5,null,null,null,null,25,22,22,22,null,null,null,null,null,null,null,null,2.5,null,null,null,null,null,null,null,null,null,null,null,null,null,null,2.5,null,null,null,null,null,null,null,null,null,null,null,null,null,null,null,2.5,27,26,25,32,null,null,null,44,44,32,44,null,null,null,2.5,null,null,null,null,null,null,null,null,null,null,null,null,null,null,2.5,null,null,null,null,27,23,23,null,null,null,null,35,30,30,2.5,34,32,31,42,35,30,30,58,58,39,58,44,37,37,2.5,null,null,null,null,37,32,32,32,null,null,null,null,43,37,37,37,2.5,null,null,null,null,null,null,null,null,null,null,null,null,null,null,2.5,null,null,null,null,null,null,null,null,null,null,null,null,null,null,2.5,null,null,null,null,null,null,null,null,null,null,null,null,null,null,2.5,null,null,null,null,null,null,null,null,null,null,null,null,null,null,2.5,null,null,null,null,null,null,null,null,null,null,null,null,null,null,2.5,null,null,null,null,null,null,null,null,null,null,null,null,null,null,2.5,null,null,null,null,null,null,null,null,null,null,null,null,null,null,2.5,null,null,null,null,null,null,null,null,null,null,null,null,null,null,2.5,null,null,null,null,null,null,null,null,null,null,null,null,null,null,2.5,null,null,null,null,null,null,null,null,null,null,null,null,null,null,2.5,null,null,null,null,null,null,null,null,null,null,null,null,null,null,2.5,null,null,null,null,null,null,null,null,null,null,null,null,null,null,2.5,null,null,null,null,null,null,null,null,null,null,null,null,null,null,2.5,null,null,null,null,null,null,null,null,null,null,null,null,null,null,2.5,null,null,null,null,29,25,25]
[null,6,4,29,26,25,37,null,null,null,null,null,null,null,null,null,null,4,29,26,25,37,null,null,null,null,null,null,null,null,null,null,4,null,null,null,null,null,null,null,null,null,null,null,null,null,null,4,null,null,null,null,null,null,null,null,null,null,null,null,null,null,4,null,null,null,null,34,29,29,29,null,null,null,null,null,null,null,null,4,null,null,null,null,null,null,null,null,null,null,null,null,null,null,4,null,null,null,null,null,null,null,null,null,null,null,null,null,null,null,4,35,34,33,42,null,null,null,58,58,41,58,null,null,null,4,33,31,30,40,33,29,29,null,null,null,null,null,null,null,4,null,null,null,null,35,31,31,null,null,null,null,45,39,39,4,45,42,41,55,46,39,39,75,75,50,75,57,48,48,4,null,null,null,null,50,42,42,42,null,null,null,null,57,48,48,48,4,null,null,null,null,null,null,null,null,null,null,null,null,null,null,4,null,null,null,null,null,null,null,null,null,null,null,null,null,null,4,null,null,null,null,null,null,null,null,null,null,null,null,null,null,4,null,null,null,null,null,null,null,null,null,null,null,null,null,null,4,null,null,null,null,null,null,null,null,null,null,null,null,null,null,4,null,null,null,null,null,null,null,null,null,null,null,null,null,null,4,null,null,null,null,null,null,null,null,null,null,null,null,null,null,4,null,null,null,null,null,null,null,null,null,null,null,null,null,null,4,null,null,null,null,null,null,null,null,null,null,null,null,null,null,4,null,null,null,null,null,null,null,null,null,null,null,null,null,null,4,null,null,null,null,null,null,null,null,null,null,null,null,null,null,4,null,null,null,null,null,null,null,null,null,null,null,null,null,null,4,null,null,null,null,null,null,null,null,null,null,null,null,null,null,4,null,null,null,null,null,null,null,null,null,null,null,null,null,null,4,null,null,null,null,39,34,34]
[null,7,6,39,35,34,49,null,null,null,null,null,null,null,null,null,null,6,38,34,33,48,null,null,null,null,null,null,null,null,null,null,6,null,null,null,null,null,null,null,null,null,null,null,null,null,null,6,null,null,null,null,null,null,null,null,null,null,null,null,null,null,6,null,null,null,null,44,37,37,37,null,null,null,null,null,null,null,null,6,null,null,null,null,null,null,null,null,null,null,null,null,null,null,6,null,null,null,null,null,null,null,null,null,null,null,null,null,null,null,6,45,43,42,54,null,null,null,74,74,52,74,null,null,null,6,42,40,39,51,43,37,37,null,null,null,null,null,null,null,6,null,null,null,null,46,40,40,null,null,null,null,58,50,50,6,57,53,52,69,59,50,50,94,94,63,94,79,60,60,6,null,null,null,null,63,53,53,53,null,null,null,null,71,60,60,60,6,null,null,null,null,null,null,null,null,null,null,null,null,null,null,6,null,null,null,null,null,null,null,null,null,null,null,null,null,null,6,null,null,null,null,null,null,null,null,null,null,null,null,null,null,6,null,null,null,null,null,null,null,null,null,null,null,null,null,null,6,null,null,null,null,null,null,null,null,null,null,null,null,null,null,6,null,null,null,null,null,null,null,null,null,null,null,null,null,null,6,null,null,null,null,null,null,null,null,null,null,null,null,null,null,6,null,null,null,null,null,null,null,null,null,null,null,null,null,null,6,null,null,null,null,null,null,null,null,null,null,null,null,null,null,6,null,null,null,null,null,null,null,null,null,null,null,null,null,null,6,null,null,null,null,null,null,null,null,null,null,null,null,null,null,6,null,null,null,null,null,null,null,null,null,null,null,null,null,null,6,null,null,null,null,null,null,null,null,null,null,null,null,null,null,6,null,null,null,null,null,null,null,null,null,null,null,null,null,null,6,null,null,null,null,51,44,44]
[null,8,10,54,50,48,68,null,null,null,null,null,null,null,null,null,null,10,54,50,49,68,null,null,null,null,null,null,null,null,null,null,10,null,null,null,null,null,null,null,null,null,null,null,null,null,null,10,null,null,null,null,null,null,null,null,null,null,null,null,null,null,10,null,null,null,null,60,52,52,52,null,null,null,null,null,null,null,null,10,null,null,null,null,null,null,null,null,null,null,null,null,null,null,10,null,null,null,null,null,null,null,null,null,null,null,null,null,null,null,10,61,59,57,73,null,null,null,100,100,69,100,null,null,null,10,61,58,56,73,61,52,52,null,null,null,null,null,null,null,10,null,null,null,null,63,55,55,null,null,null,null,77,66,66,10,76,71,65,93,79,67,67,125,125,83,125,93,79,79,10,null,null,null,null,83,71,71,71,null,null,null,null,93,79,79,79,10,84,81,79,100,null,73,null,123,123,85,123,null,80,null,10,86,83,81,100,null,80,null,120,120,84,120,null,84,null,10,null,null,null,null,null,null,null,null,null,null,null,null,null,null,10,null,null,null,null,null,null,null,null,null,null,null,null,null,null,10,null,null,null,null,null,null,null,null,null,null,null,null,null,null,10,null,null,null,null,null,null,null,null,null,null,null,null,null,null,10,null,null,null,null,null,null,null,null,null,null,null,null,null,null,10,null,null,null,null,null,null,null,null,null,null,null,null,null,null,10,41.686890118857434,38.368800879682816,37.255016880797221,52.225010902907414,null,null,null,null,null,null,null,null,null,null,10,41.157930720852178,37.817686377926606,36.723621438776284,51.560862343750536,null,null,null,null,null,null,null,null,null,null,10,null,null,null,null,null,null,null,null,null,null,null,null,null,null,10,null,null,null,null,null,null,null,null,null,null,null,null,null,null,10,null,null,null,null,null,null,null,null,null,null,null,null,null,null,10,59,55,54,72,61,52,52,96,96,64,96,72,61,61,10]
[null,9,16,72,67,65,91,null,null,null,null,null,null,null,null,null,null,16,72,67,65,91,null,null,null,null,null,null,null,null,null,null,16,null,null,null,null,null,null,null,null,null,null,null,null,null,null,16,null,null,null,null,null,null,null,null,null,null,null,null,null,null,16,null,null,null,null,80,69,69,69,null,null,null,null,null,null,null,null,16,null,null,null,null,null,null,null,null,null,null,null,null,null,null,16,null,null,null,null,null,null,null,null,null,null,null,null,null,null,null,16,81,78,76,96,null,null,null,131,131,89,131,null,null,null,16,79,76,74,95,80,69,69,null,null,null,null,null,null,null,16,null,null,null,null,84,72,72,null,null,null,null,100,85,85,16,101,95,92,123,105,85,85,162,162,107,162,121,98,98,16,null,null,null,null,111,94,94,94,null,null,null,null,121,102,102,102,16,110,106,103,131,null,96,null,160,160,109,160,null,103,null,16,113,109,107,132,null,105,null,156,156,108,156,null,108,null,16,116,114,111,134,null,115,null,155,155,109,155,null,113,null,16,null,null,null,null,null,null,null,null,null,null,null,null,null,null,16,null,null,null,null,null,null,null,null,null,null,null,null,null,null,16,null,null,null,null,null,null,null,null,null,null,null,null,null,null,16,null,null,null,null,null,null,null,null,null,null,null,null,null,null,16,null,null,null,null,null,null,null,null,null,null,null,null,null,null,16,56.303186775227218,52.272082104998709,50.732781377546992,70.4506516380943,null,null,null,null,null,null,null,null,null,null,16,55.133443172787679,51.032596159360459,49.536631450873926,69.030122269522465,null,null,null,null,null,null,null,null,null,null,16,null,null,null,null,null,null,null,null,null,null,null,null,null,null,16,null,null,null,null,null,null,null,null,null,null,null,null,null,null,16,null,null,null,null,null,null,null,null,null,null,null,null,null,null,16,78,74,72,95,82,69,69,126,126,82,126,94,79,79,16]
[null,10,25,98,92,89,122,null,null,null,null,null,null,null,null,null,null,25,96,91,88,120,null,null,null,null,null,null,null,null,null,null,25,null,null,null,null,null,null,null,null,null,null,null,null,null,null,25,null,null,null,null,null,null,null,null,null,null,null,null,null,null,25,null,null,null,null,107,92,92,92,null,null,null,null,null,null,null,null,25,null,null,null,null,null,null,null,null,null,null,null,null,null,null,25,null,null,null,null,null,null,null,null,null,null,null,null,null,null,null,25,107,103,100,128,null,null,null,170,170,115,170,null,null,null,25,105,101,98,125,104,90,90,null,null,null,null,null,null,null,25,null,null,null,null,111,97,97,null,null,null,null,129,110,110,25,135,128,125,164,141,120,120,210,210,137,210,156,132,132,25,null,null,null,null,147,125,125,125,null,null,null,null,156,132,132,132,25,144,139,135,171,null,126,null,205,205,138,205,null,133,null,25,149,145,142,175,null,139,null,203,203,139,203,null,138,null,25,152,149,145,176,null,149,null,200,200,139,200,null,144,null,25,154,151,148,177,null,146,null,198,198,140,198,null,140,null,25,null,null,null,null,null,null,null,null,null,null,null,null,null,null,25,null,null,null,null,null,null,null,null,null,null,null,null,null,null,25,null,null,null,null,null,null,null,null,null,null,null,null,null,null,25,null,null,null,null,null,null,null,null,null,null,null,null,null,null,25,76.312604904647941,71.67614763407407,69.550196846769623,94.902896939709009,null,null,null,null,null,null,null,null,null,null,25,74.656525579944486,69.92446690482258,67.862843011372988,92.884362086782573,null,null,null,null,null,null,null,null,null,null,25,null,null,null,null,null,null,null,null,null,null,null,null,null,null,25,null,null,null,null,null,null,null,null,null,null,null,null,null,null,25,null,null,null,null,null,null,null,null,null,null,null,null,null,null,25,105,100,97,128,110,93,93,163,163,107,163,121,103,103,25]
[null,11,35,121,115,111,151,null,null,null,null,null,null,null,null,null,null,35,121,114,111,151,null,null,null,null,null,null,null,null,null,null,35,null,null,null,null,null,null,null,null,null,null,null,null,null,null,35,null,null,null,null,null,null,null,null,null,null,null,null,null,null,35,null,null,null,null,131,113,113,113,null,null,null,null,null,null,null,null,35,null,null,null,null,null,null,null,null,null,null,null,null,null,null,35,null,null,null,null,null,null,null,null,null,null,null,null,null,null,null,35,131,126,123,157,null,null,null,206,206,138,206,null,null,null,35,130,126,122,155,130,112,112,null,null,null,null,null,null,null,35,null,null,null,null,136,118,118,null,null,null,null,155,132,132,35,166,158,154,202,174,148,148,253,253,165,253,188,159,159,35,null,null,null,null,182,154,154,154,null,null,null,null,188,158,158,158,35,176,170,166,210,null,154,null,250,250,167,250,null,159,null,35,182,177,172,213,null,168,null,244,244,167,244,null,165,null,35,184,181,176,214,null,177,null,241,241,167,241,null,169,null,35,187,184,179,215,null,178,null,237,237,167,237,null,168,null,35,188,186,181,214,null,176,null,235,235,166,235,null,166,null,35,191,190,186,213,null,154,null,228,228,166,228,null,149,null,35,null,null,null,null,null,null,null,null,null,null,null,null,null,null,35,null,null,null,null,null,null,null,null,null,null,null,null,null,null,35,93.318897576815587,88.183343989716974,85.556965604254543,115.62898523984255,null,null,null,null,null,null,null,null,null,null,35,92.003946590262387,86.68114752723686,84.090226165529202,114.37438105882238,null,null,null,null,null,null,null,null,null,null,35,null,null,null,164,null,null,null,null,null,null,null,null,null,null,35,null,null,null,165,null,null,null,null,null,null,null,null,null,null,35,null,null,null,200,null,null,null,null,null,null,null,null,null,null,35,128,122,119,156,134,114,114,196,196,128,196,146,123,123,35]
[null,12,50,149,141,137,184,null,null,null,null,null,null,null,null,null,null,50,154,147,142,191,null,null,null,null,null,null,null,null,null,null,50,null,null,null,null,null,null,null,null,null,null,null,null,null,null,50,null,null,null,null,null,null,null,null,null,null,null,null,null,null,50,null,null,null,null,null,null,null,null,null,null,null,null,null,null,null,null,50,null,null,null,null,null,null,null,null,null,null,null,null,null,null,50,null,null,null,null,null,null,null,null,null,null,null,null,null,null,null,50,158,153,148,189,160,136,136,245,245,163,245,195,164,164,50,null,null,null,null,null,null,null,null,null,null,null,null,null,null,50,null,null,null,null,1654,143,143,null,null,null,null,183,155,155,50,201,193,187,245,211,180,180,300,300,195,300,222,188,188,50,null,null,null,null,219,186,186,186,null,null,null,null,222,187,187,187,50,213,206,200,255,null,186,null,297,297,197,297,null,188,null,50,218,213,208,256,null,202,null,290,290,197,290,null,195,null,50,221,217,212,258,null,210,null,286,286,197,286,null,198,null,50,224,220,215,258,null,212,null,283,283,197,283,null,197,null,50,225,222,217,258,null,212,null,279,279,197,279,null,196,null,50,228,226,221,256,null,208,null,273,273,196,273,null,192,null,50,null,null,null,null,null,null,null,null,null,null,null,null,null,null,50,null,null,null,null,null,null,null,null,null,null,null,null,null,null,50,115.52497666444512,110.00082788111338,106.66949415533389,142.82898431242771,null,null,null,null,null,null,null,null,null,null,50,113.10911673220951,107.4638046612355,104.23518908208187,139.827907709773,null,null,null,null,null,null,null,null,null,null,50,null,null,null,198,null,null,null,null,null,null,null,null,null,null,50,null,null,null,199,null,null,null,null,null,null,null,null,null,null,50,null,null,null,251,null,null,null,null,null,null,null,null,null,null,50,155,149,145,189,163,139,139,232,232,151,232,172,145,145,50]
[null,13,70,189,181,175,234,null,null,null,null,null,null,null,null,null,null,70,194,186,180,240,null,null,null,null,null,null,null,null,null,null,70,null,null,null,null,null,null,null,null,null,null,null,null,null,null,70,null,null,null,null,null,null,null,null,null,null,null,null,null,null,70,null,null,null,null,null,null,null,null,null,null,null,null,null,null,null,null,70,null,null,null,null,null,null,null,null,null,null,null,null,null,null,70,null,null,null,null,null,null,null,null,null,null,null,null,null,null,null,70,199,193,187,238,200,174,174,302,302,200,302,239,205,205,70,null,null,null,null,null,null,null,null,null,null,null,null,null,null,70,null,null,null,null,206,179,179,null,null,null,null,224,190,190,70,254,245,238,309,267,227,227,368,368,239,368,272,230,230,70,null,null,null,null,275,233,233,233,null,null,null,null,271,228,228,228,70,267,260,255,320,null,233,null,365,365,241,365,null,229,null,70,372,267,259,321,null,251,null,356,356,240,356,null,237,null,70,276,271,264,322,null,259,null,352,352,241,352,null,240,null,70,279,275,268,322,null,262,null,347,347,240,347,null,240,null,70,280,277,270,321,null,263,null,344,344,240,344,null,239,null,70,283,281,275,319,null,263,null,336,336,240,336,null,237,null,70,null,null,null,null,null,null,null,null,null,null,null,null,null,null,70,null,null,null,null,null,null,null,null,null,null,null,null,null,null,70,147.44162206233966,141.26816055789993,136.89209142804796,182.21427171315835,null,null,null,null,null,null,null,null,null,null,70,143.90536960165781,137.543283537013,133.32189371186021,177.84928145338625,null,null,null,null,null,null,null,null,null,null,70,null,null,null,250,null,null,null,null,null,null,null,null,null,null,70,null,null,null,250,null,null,null,null,null,null,null,null,null,null,70,null,null,null,306,null,null,null,null,null,null,null,null,null,null,70,197,190,184,240,207,176,176,285,285,185,285,211,178,178,70]
[null,14,95,237,228,221,292,null,null,null,null,null,null,null,null,null,null,95,235,227,219,289,null,null,null,null,null,null,null,null,null,null,95,null,null,null,null,null,null,null,null,null,null,null,null,null,null,95,null,null,null,null,null,null,null,null,null,null,null,null,null,null,95,null,null,null,null,null,null,null,null,null,null,null,null,null,null,null,null,95,null,null,null,null,null,null,null,null,null,null,null,null,null,null,95,null,null,null,null,null,null,null,null,null,null,null,null,null,null,null,95,245,239,232,294,245,213,213,363,363,240,363,288,245,245,95,null,null,null,null,null,null,null,null,null,null,null,null,null,null,95,null,null,null,null,253,220,220,null,null,null,null,268,227,227,95,315,306,296,383,329,280,280,442,442,286,442,326,276,276,95,null,null,null,null,337,286,286,286,null,null,null,null,325,273,273,273,95,328,320,311,394,null,286,null,439,439,289,439,null,275,null,95,333,327,318,393,null,307,null,428,429,288,429,null,284,null,95,337,332,323,394,null,297,null,424,424,288,424,null,281,null,95,340,336,327,394,null,319,null,419,419,288,419,null,287,null,95,342,338,330,393,null,321,null,414,414,288,414,null,286,null,95,345,343,335,390,null,321,null,405,405,287,405,null,284,null,95,null,null,null,null,null,null,null,null,null,null,null,null,null,null,95,null,null,null,null,null,null,null,null,null,null,null,null,null,null,95,183.31526265125351,176.80379165859958,171.25201915912336,225.67095879461553,null,null,null,null,null,null,null,null,null,null,95,178.13550156297745,171.34003870673041,166.01815507441393,219.33618581819871,null,null,null,null,null,null,null,null,null,null,95,null,null,null,306,null,null,null,null,null,null,null,null,null,null,95,null,null,null,305,null,null,null,null,null,null,null,null,null,null,95,null,null,null,355,null,null,null,null,null,null,null,null,null,null,95,243,236,228,295,254,216,216,342,342,221,342,253,213,213,95]
[null,15,120,276,268,259,341,null,null,null,null,null,null,null,null,null,null,120,278,269,260,342,null,null,null,null,null,null,null,null,null,null,120,null,null,null,null,null,null,null,null,null,null,null,null,null,null,120,null,null,null,null,null,null,null,null,null,null,null,null,null,null,120,null,null,null,null,null,null,null,null,null,null,null,null,null,null,null,null,120,null,null,null,null,null,null,null,null,null,null,null,null,null,null,120,null,null,null,null,null,null,null,null,null,null,null,null,null,null,null,120,285,278,270,342,285,247,247,414,415,274,415,329,279,279,120,null,null,null,null,null,null,null,null,null,null,null,null,null,null,120,null,null,null,null,292,253,253,null,null,null,null,305,257,257,120,367,357,346,446,382,326,326,410,399,387,497,371,313,313,120,null,null,null,null,389,332,332,332,null,null,null,null,368,310,310,310,120,381,372,361,456,null,331,null,499,500,328,500,null,312,null,120,386,379,368,455,null,353,null,489,489,327,489,null,322,null,120,390,384,373,456,null,363,null,484,484,327,484,null,325,null,120,392,388,377,454,null,307,null,478,478,327,478,null,325,null,120,394,390,380,453,null,369,null,472,473,327,473,null,325,null,120,397,395,385,450,null,370,null,463,463,327,463,null,323,null,120,null,null,null,null,null,null,null,null,null,null,null,null,null,null,120,null,null,null,null,null,null,null,null,null,null,null,null,null,null,120,213.7750419940331,206.86333546980725,200.24809520899615,263.19098457394273,null,null,null,null,null,null,null,null,null,null,120,208.68461586632461,201.50441947726989,195.12468617516251,256.92085616330507,null,null,null,null,null,null,null,null,null,null,120,null,null,null,355,null,null,null,null,null,null,null,null,null,null,120,null,null,null,353,null,null,null,null,null,null,null,null,null,null,120,null,null,null,403,null,null,null,null,null,null,null,null,null,null,120,285,277,268,345,296,253,253,390,390,252,391,288,243,243,120]
[null,16,150,318,309,299,391,null,null,null,null,null,null,null,null,null,null,150,322,314,303,396,null,null,null,null,null,null,null,null,null,null,150,null,null,null,null,null,null,null,null,null,null,null,null,null,null,150,null,null,null,null,null,null,null,null,null,null,null,null,null,null,150,null,null,null,null,null,null,null,null,null,null,null,null,null,null,null,null,150,null,null,null,null,null,null,null,null,null,null,null,null,null,null,150,null,null,null,null,null,null,null,null,null,null,null,null,null,null,null,150,327,320,311,390,325,284,284,463,463,300,464,368,315,315,150,null,null,null,null,null,null,null,null,null,null,null,null,null,null,150,null,null,null,null,330,287,287,null,null,null,null,339,287,287,150,442,411,398,510,436,372,372,562,563,364,564,415,350,350,150,null,null,null,null,444,376,376,376,null,null,null,null,412,346,346,346,150,434,425,412,521,null,377,null,561,562,368,562,null,350,null,150,439,432,419,518,null,400,null,549,549,366,550,null,360,null,150,443,437,425,518,null,412,null,543,544,366,544,null,364,null,150,446,441,429,517,null,416,null,538,538,367,538,null,364,null,150,448,444,432,516,null,418,null,532,532,366,533,null,364,null,150,451,448,437,510,null,419,null,520,521,366,521,null,363,null,150,null,null,null,null,null,null,null,null,null,null,null,null,null,null,150,null,null,null,null,null,null,null,null,null,null,null,null,null,null,150,245.98454152914229,239.09891586122723,231.399394339872,301.58109308336964,null,null,null,null,null,null,null,null,null,null,150,239.22865604283828,231.90330363214946,224.48384873038069,293.70421799729814,null,null,null,null,null,null,null,null,null,null,150,null,null,null,405,null,null,null,null,null,null,null,null,null,null,150,null,null,null,402,null,null,null,null,null,null,null,null,null,null,150,null,null,null,464,null,null,null,null,null,null,null,null,null,null,150,325,317,308,393,337,288,288,435,436,282,436,322,271,271,150]
[null,17,185,370,361,348,454,null,null,null,null,null,null,null,null,null,null,185,365,357,345,448,null,null,null,null,null,null,null,null,null,null,185,null,null,null,null,null,null,null,null,null,null,null,null,null,null,185,null,null,null,null,null,null,null,null,null,null,null,null,null,null,185,null,null,null,null,null,null,null,null,null,null,null,null,null,null,null,null,185,null,null,null,null,null,null,null,null,null,null,null,null,null,null,185,null,null,null,null,null,null,null,null,null,null,null,null,null,null,null,185,378,372,360,451,374,325,325,523,524,346,525,417,355,355,185,null,null,null,null,null,null,null,null,null,null,null,null,null,null,185,null,null,null,null,378,328,328,null,null,null,null,382,322,322,185,488,477,462,589,504,431,431,634,636,412,637,468,395,395,185,null,null,null,null,509,430,430,430,null,null,null,null,463,388,388,388,185,500,491,476,600,null,433,null,634,635,415,636,null,395,null,185,507,499,485,599,null,460,null,623,624,414,625,null,406,null,185,510,504,489,596,null,472,null,616,616,414,617,null,410,null,185,513,508,494,595,null,476,null,609,609,414,610,null,411,null,185,514,510,496,592,null,478,null,602,603,414,603,null,411,null,185,516,514,501,586,null,479,null,591,591,414,591,null,409,null,185,null,null,null,null,null,null,null,null,null,null,null,null,null,null,185,null,null,null,null,null,null,null,null,null,null,null,null,null,null,185,287.20905887821118,280.24982489138932,271.03864372031552,351.53264744319978,null,null,null,null,null,null,null,null,null,null,185,278.83039013948525,271.45381912831834,262.65015232424025,341.2228333445666,null,null,null,null,null,null,null,null,null,null,185,null,null,null,468,null,null,null,null,null,null,null,null,null,null,185,null,null,null,464,null,null,null,null,null,null,null,null,null,null,185,null,null,null,552,null,null,null,null,null,null,null,null,null,null,185,379,371,360,458,391,334,334,494,495,321,495,364,308,308,185]
[null,18,240,443,434,418,543,null,null,null,null,null,null,null,null,null,null,240,440,432,416,539,null,null,null,null,null,null,null,null,null,null,240,null,null,null,null,null,null,null,null,null,null,null,null,null,null,240,null,null,null,null,null,null,null,null,null,null,null,null,null,null,240,null,null,null,null,null,null,null,null,null,null,null,null,null,null,null,null,240,null,null,null,null,null,null,null,null,null,null,null,null,null,null,240,null,null,null,null,null,null,null,null,null,null,null,null,null,null,null,240,450,444,430,536,440,384,384,604,607,401,609,481,411,411,240,null,null,null,null,null,null,null,null,null,null,null,null,null,null,240,null,null,null,null,443,391,391,null,null,null,null,439,377,377,240,584,574,555,706,597,482,482,735,738,477,741,540,442,442,240,null,null,null,null,600,505,505,505,null,null,null,null,534,445,445,445,240,595,586,567,714,null,513,null,735,738,480,740,null,456,null,240,600,593,575,709,null,542,null,721,723,479,725,null,469,null,240,604,598,581,708,null,555,null,716,717,480,719,null,474,null,240,607,602,585,705,null,559,null,708,709,480,711,null,474,null,240,608,604,587,702,null,562,null,702,703,480,705,null,475,null,240,610,607,592,693,null,564,null,689,689,480,690,null,475,null,240,null,null,null,null,null,null,null,null,null,null,null,null,null,null,240,null,null,null,null,null,null,null,null,null,null,null,null,null,null,240,344.56033640664907,337.62844430457591,326.21888503500054,420.86480157505969,null,null,null,null,null,null,null,null,null,null,240,335.06629191559114,327.67617591221079,316.74806279512791,409.18178973556792,null,null,null,null,null,null,null,null,null,null,240,null,null,null,560,null,null,null,null,null,null,null,null,null,null,240,null,null,null,553,null,null,null,null,null,null,null,null,null,null,240,null,null,null,null,null,null,null,null,null,null,null,null,null,null,240,454,446,432,548,466,398,398,574,575,373,576,423,357,357,240]
[null,19,300,513,504,485,628,null,null,null,null,null,null,null,null,null,null,300,null,null,null,null,null,null,null,null,null,null,null,null,null,null,300,null,null,null,null,null,null,null,null,null,null,null,null,null,null,300,null,null,null,null,null,null,null,null,null,null,null,null,null,null,300,null,null,null,null,null,null,null,null,null,null,null,null,null,null,null,null,300,null,null,null,null,null,null,null,null,null,null,null,null,null,null,300,null,null,null,null,null,null,null,null,null,null,null,null,null,null,null,300,519,514,496,619,505,438,438,681,685,451,689,541,462,462,300,null,null,null,null,null,null,null,null,null,null,null,null,null,null,300,null,null,null,null,506,435,435,null,null,null,null,492,408,408,300,675,665,642,815,685,586,586,827,832,537,837,606,512,512,300,null,null,null,null,684,574,574,574,null,null,null,null,597,496,496,496,300,686,677,653,825,null,588,null,830,834,540,838,null,512,null,300,691,685,663,816,null,621,null,812,816,540,819,null,527,null,300,695,689,667,815,null,635,null,808,811,540,814,null,532,null,300,697,692,672,812,null,639,null,802,804,541,807,null,534,null,300,698,694,674,807,null,641,null,794,797,541,799,null,534,null,300,699,697,678,796,null,645,null,780,781,541,783,null,535,null,300,null,null,null,null,null,null,null,null,null,null,null,null,null,null,300,null,null,null,null,null,null,null,null,null,null,null,null,null,null,300,399.81841256975326,393.06199944618123,379.38804071157534,487.54511487480454,null,null,null,null,null,null,null,null,null,null,300,388.65021480845172,381.36627052430373,368.27661293582946,473.83020597289516,null,null,null,null,null,null,null,null,null,null,300,null,null,null,null,null,null,null,null,null,null,null,null,null,null,300,null,null,null,null,null,null,null,null,null,null,null,null,null,null,300,null,null,null,null,null,null,null,null,null,null,null,null,null,null,300,526,518,501,633,536,458,458,648,649,420,651,476,403,403,300]
[null,20,400,599,592,567,736,null,null,null,null,null,null,null,null,null,null,400,null,null,null,null,null,null,null,null,null,null,null,null,null,null,400,null,null,null,null,null,null,null,null,null,null,null,null,null,null,400,null,null,null,null,null,null,null,null,null,null,null,null,null,null,400,null,null,null,null,null,null,null,null,null,null,null,null,null,null,null,null,400,null,null,null,null,null,null,null,null,null,null,null,null,null,null,400,null,null,null,null,null,null,null,null,null,null,null,null,null,null,null,400,605,600,578,723,null,null,null,771,779,511,786,null,null,null,400,null,null,null,null,null,null,null,null,null,null,null,null,null,null,400,null,null,null,null,null,null,null,null,null,null,null,null,null,null,400,788,779,750,952,791,677,677,935,944,608,952,683,577,577,400,null,null,null,null,783,652,652,652,null,null,null,null,670,549,549,549,400,798,790,761,961,null,678,null,938,946,611,954,null,578,null,400,804,798,771,749,null,716,null,921,927,612,933,null,595,null,400,805,800,773,947,null,729,null,918,924,612,929,null,600,null,400,808,804,778,943,null,734,null,912,917,614,922,null,603,null,400,808,805,780,937,null,736,null,904,909,614,913,null,604,null,400,809,807,784,924,null,740,null,889,893,615,896,null,606,null,400,null,null,null,null,null,null,null,null,886,627,888,null,null,null,400,null,null,null,null,null,null,null,null,863,623,864,null,null,null,400,471.21817389699532,464.76048526042871,447.81763001283304,574.26966167677767,null,null,null,null,null,null,null,null,null,null,400,458.00596274947168,450.95056633887668,434.75284846505116,557.95774063081853,null,null,null,null,null,null,null,null,null,null,400,null,null,null,null,null,null,null,null,null,null,null,null,null,null,400,null,null,null,null,null,null,null,null,null,null,null,null,null,null,400,null,null,null,null,null,null,null,null,null,null,null,null,null,null,400,619,612,591,745,626,536,536,741,743,481,746,544,460,460,400]
[null,21,500,null,null,null,null,null,null,null,null,null,null,null,null,null,null,500,null,null,null,null,null,null,null,null,null,null,null,null,null,null,500,null,null,null,null,null,null,null,null,null,null,null,null,null,null,500,null,null,null,null,null,null,null,null,null,null,null,null,null,null,500,null,null,null,null,null,null,null,null,null,null,null,null,null,null,null,null,500,null,null,null,null,null,null,null,null,null,null,null,null,null,null,500,null,null,null,null,null,null,null,null,null,null,null,null,null,null,null,500,702,699,671,839,null,null,null,866,877,575,890,null,null,null,500,null,null,null,null,null,null,null,null,null,null,null,null,null,null,500,null,null,null,null,null,null,null,null,null,null,null,null,null,null,500,920,913,875,1114,null,null,null,1054,1069,686,1084,null,null,null,500,null,null,null,null,null,null,null,null,null,null,null,null,null,null,null,null,500,null,null,null,null,null,null,null,null,null,null,null,null,null,null,500,934,930,896,1105,null,null,null,1041,1051,692,1062,null,null,null,500,936,932,898,1103,null,null,null,1039,1049,693,1060,null,null,null,500,941,938,905,1102,null,null,null,1036,1045,696,1054,null,null,null,500,938,936,905,1090,null,null,null,1026,1034,695,1043,null,null,null,500,937,937,908,1073,null,null,null,1011,1018,697,1024,null,null,null,500,null,null,null,null,null,null,null,null,1016,714,1020,null,null,null,500,null,null,null,null,null,null,null,null,989,710,991,null,null,null,500,556.20155970364112,550.6238446822407,529.40897394591855,676.41794234893052,null,null,null,null,null,null,null,null,null,null,500,541.69574278031655,535.49821777954298,515.18299123602105,658.3999828103714,null,null,null,null,null,null,null,null,null,null,500,null,null,null,null,null,null,null,null,null,null,null,null,null,null,500,null,null,null,null,null,null,null,null,null,null,null,null,null,null,500,null,null,null,null,null,null,null,null,null,null,null,null,null,null,500,733,726,700,883,null,null,null,848,853,551,858,null,null,null,500]
[null,22,630,null,null,null,null,null,null,null,null,null,null,null,null,null,null,630,null,null,null,null,null,null,null,null,null,null,null,null,null,null,630,null,null,null,null,null,null,null,null,null,null,null,null,null,null,630,null,null,null,null,null,null,null,null,null,null,null,null,null,null,630,null,null,null,null,null,null,null,null,null,null,null,null,null,null,null,null,630,null,null,null,null,null,null,null,null,null,null,null,null,null,null,630,null,null,null,null,null,null,null,null,null,null,null,null,null,null,null,630,null,null,null,null,null,null,null,null,null,null,null,null,null,null,630,null,null,null,null,null,null,null,null,null,null,null,null,null,null,630,null,null,null,null,null,null,null,null,null,null,null,null,null,null,630,1067,1064,1014,1298,null,null,null,1179,1204,768,1229,null,null,null,630,null,null,null,null,null,null,null,null,null,null,null,null,null,null,null,null,630,null,null,null,null,null,null,null,null,null,null,null,null,null,null,630,1080,1079,1035,1284,null,null,null,1170,1189,777,1209,null,null,null,630,1082,1081,1037,1285,null,null,null,1171,1189,779,1208,null,null,null,630,1088,1088,1045,1283,null,null,null,1169,1185,783,1203,null,null,null,630,1079,1079,1038,1263,null,null,null,1156,1172,781,1188,null,null,null,630,1084,1085,1048,1247,null,null,null,1146,1158,787,1171,null,null,null,630,null,null,null,null,null,null,null,null,1159,809,1167,null,null,null,630,null,null,null,null,null,null,null,null,1131,807,1137,null,null,null,630,null,null,null,null,null,null,null,null,null,null,null,null,null,null,630,null,null,null,null,null,null,null,null,null,null,null,null,null,null,630,null,null,null,null,null,null,null,null,null,null,null,null,null,null,630,null,null,null,null,null,null,null,null,null,null,null,null,null,null,630,null,null,null,null,null,null,null,null,null,null,null,null,null,null,630,null,null,null,null,null,null,null,null,null,null,null,null,null,null,630]
[null,23,800,null,null,null,null,null,null,null,null,null,null,null,null,null,null,800,null,null,null,null,null,null,null,null,null,null,null,null,null,null,800,null,null,null,null,null,null,null,null,null,null,null,null,null,null,800,null,null,null,null,null,null,null,null,null,null,null,null,null,null,800,null,null,null,null,null,null,null,null,null,null,null,null,null,null,null,null,800,null,null,null,null,null,null,null,null,null,null,null,null,null,null,800,null,null,null,null,null,null,null,null,null,null,null,null,null,null,null,800,null,null,null,null,null,null,null,null,null,null,null,null,null,null,800,null,null,null,null,null,null,null,null,null,null,null,null,null,null,800,null,null,null,null,null,null,null,null,null,null,null,null,null,null,800,1216,1220,1156,1494,null,null,null,1301,1339,849,1380,null,null,null,800,null,null,null,null,null,null,null,null,null,null,null,null,null,null,null,null,800,null,null,null,null,null,null,null,null,null,null,null,null,null,null,800,1229,1235,1176,1477,null,null,null,1298,1328,861,1361,null,null,null,800,1232,1237,1179,1478,null,null,null,1299,1328,862,1360,null,null,null,800,1238,1243,1188,1472,null,null,null,1297,1324,867,1353,null,null,null,800,1228,1234,1180,1451,null,null,null,1287,1312,866,1340,null,null,null,800,1234,1240,1192,1433,null,null,null,1279,1300,876,1322,null,null,null,800,null,null,null,null,null,null,null,null,1307,905,1320,null,null,null,800,null,null,null,null,null,null,null,null,1277,904,1287,null,null,null,800,null,null,null,null,null,null,null,null,null,null,null,null,null,null,800,null,null,null,null,null,null,null,null,null,null,null,null,null,null,800,null,null,null,null,null,null,null,null,null,null,null,null,null,null,800,null,null,null,null,null,null,null,null,null,null,null,null,null,null,800,null,null,null,null,null,null,null,null,null,null,null,null,null,null,800,null,null,null,null,null,null,null,null,null,null,null,null,null,null,800]
[null,24,1000,null,null,null,null,null,null,null,null,null,null,null,null,null,null,1000,null,null,null,null,null,null,null,null,null,null,null,null,null,null,1000,null,null,null,null,null,null,null,null,null,null,null,null,null,null,1000,null,null,null,null,null,null,null,null,null,null,null,null,null,null,1000,null,null,null,null,null,null,null,null,null,null,null,null,null,null,null,null,1000,null,null,null,null,null,null,null,null,null,null,null,null,null,null,1000,null,null,null,null,null,null,null,null,null,null,null,null,null,null,null,1000,null,null,null,null,null,null,null,null,null,null,null,null,null,null,1000,null,null,null,null,null,null,null,null,null,null,null,null,null,null,1000,null,null,null,null,null,null,null,null,null,null,null,null,null,null,1000,1371,1391,1307,1712,null,null,null,1419,1473,926,1532,null,null,null,1000,null,null,null,null,null,null,null,null,null,null,null,null,null,null,null,null,1000,null,null,null,null,null,null,null,null,null,null,null,null,null,null,1000,1384,1403,1327,1690,null,null,null,1420,1466,940,1515,null,null,null,1000,1387,1406,1330,1690,null,null,null,1422,1466,942,1514,null,null,null,1000,1394,1412,1339,1683,null,null,null,1423,1463,949,1507,null,null,null,1000,1382,1400,1330,1656,null,null,null,1411,1450,948,1492,null,null,null,1000,1394,1408,1345,1634,null,null,null,1409,1441,961,1475,null,null,null,1000,null,null,null,null,null,null,null,null,null,null,null,null,null,null,1000,null,null,null,null,null,null,null,null,null,null,null,null,null,null,1000,null,null,null,null,null,null,null,null,null,null,null,null,null,null,1000,null,null,null,null,null,null,null,null,null,null,null,null,null,null,1000,null,null,null,null,null,null,null,null,null,null,null,null,null,null,1000,null,null,null,null,null,null,null,null,null,null,null,null,null,null,1000,null,null,null,null,null,null,null,null,null,null,null,null,null,null,1000,null,null,null,null,null,null,null,null,null,null,null,null,null,null,1000]
[]
[null,null,"Status",{"$f":"C45","v":16},{"$f":"D30","v":16},{"$f":"E30","v":16},{"$f":"F30","v":16},{"$f":"G30","v":16},16,16,16,16,16,{"$f":"M30","v":16},16,16,16,16,16,16,16,16,{"$f":"V30","v":16},16,16,16,16,16,16,16,16,16,{"$f":"AF30","v":16},16,16,16,16,16,16,16,16,16,16,16,16,16,16,16,16,16,16,16,16,16,16,16,16,16,16,16,16,16,{"$f":"BJ30","v":16},16,16,16,16,16,16,16,16,{"$f":"BR30","v":16},16,16,16,16,16,16,{"$f":"BZ30","v":16},16,16,16,16,16,16,16,16,16,16,16,16,16,16,16,16,16,16,16,16,16,16,16,16,{"$f":"CX30","v":16},{"$f":"CZ30","v":16},16,16,16,16,16,{"$f":"DF30","v":16},16,16,16,16,16,16,16,16,16,16,16,16,16,16,16,16,16,16,16,16,16,16,16,16,16,16,16,16,16,16,16,{"$f":"EL30","v":16},16,16,16,16,16,16,16,16,16,16,16,16,16,16,16,16,16,16,16,16,16,16,16,16,16,16,16,{"$f":"FN30","v":16},16,16,16,16,16,16,16,{"$f":"FV30","v":16},{"$f":"FV30","v":16},16,16,16,16,16,16,{"$f":"GD30","v":16},16,16,16,16,16,16,16,16,16,16,16,16,16,16,16,16,16,16,16,16,16,16,16,16,16,16,16,16,16,16,16,{"$f":"HJ30","v":16},16,16,16,16,16,16,16,16,16,16,16,16,16,16,16,16,16,16,16,16,16,16,16,16,16,16,16,16,16,16,16,{"$f":"IP30","v":16},16,16,16,16,16,16,16,16,16,16,16,16,16,16,16,16,16,16,16,16,16,16,16,16,16,16,16,16,16,16,16,{"$f":"JV30","v":16},16,16,16,16,16,16,16,16,16,16,16,16,16,16,16,16,16,16,16,16,16,16,16,16,16,16,16,16,16,16,16,{"$f":"LB30","v":16},16,16,16,16,16,16,16,16,16,16,16,16,16,16,16,16,16,16,16,16,16,16,16,16,16,16,16,16,16,16,16,{"$f":"MH30","v":16},16,16,16,16,16,16,16,16,16,16,16,16,16,16,16,16,16,16,16,16,16,16,16,16,16,16,16,16,16,16,16,16,16,16,16,{"$f":"NR30","v":16},{"$f":"NS30","v":16},{"$f":"NT30","v":16},{"$f":"NU30","v":16},{"$f":"NV30","v":16},{"$f":"NW30","v":16},{"$f":"NX30","v":16},{"$f":"NY30","v":16},{"$f":"NZ30","v":16},{"$f":"OA30","v":16},{"$f":"OB30","v":16},{"$f":"OC30","v":16},{"$f":"OD30","v":16},{"$f":"OE30","v":16},{"$f":"OF30","v":16},{"$f":"OG30","v":16},{"$f":"OH30","v":16},{"$f":"OI30","v":16},{"$f":"OJ30","v":16},{"$f":"OK30","v":16},{"$f":"OL30","v":16},{"$f":"OM30","v":16},{"$f":"ON30","v":16},{"$f":"OO30","v":16},{"$f":"OP30","v":16},{"$f":"OQ30","v":16},{"$f":"OR30","v":16},{"$f":"OS30","v":16},{"$f":"OT30","v":16},{"$f":"OU30","v":16}]
[null,null,"Current(A)",{"$f":"CHOOSE(D30,D5,D6,D7,D8,D9,D10,D11,D12,D13,D14,D15,D16,D17,D18,D19,D20,D21,D22,D23,D24,D25,D26,D27,D28)","v":318},{"$f":"CHOOSE(E30,E5,E6,E7,E8,E9,E10,E11,E12,E13,E14,E15,E16,E17,E18,E19,E20,E21,E22,E23,E24,E25,E26,E27,E28)","v":309},{"$f":"CHOOSE(F30,F5,F6,F7,F8,F9,F10,F11,F12,F13,F14,F15,F16,F17,F18,F19,F20,F21,F22,F23,F24,F25,F26,F27,F28)","v":299},{"$f":"CHOOSE(G30,G5,G6,G7,G8,G9,G10,G11,G12,G13,G14,G15,G16,G17,G18,G19,G20,G21,G22,G23,G24,G25,G26,G27,G28)","v":391},{"$f":"CHOOSE(H30,H5,H6,H7,H8,H9,H10,H11,H12,H13,H14,H15,H16,H17,H18,H19,H20,H21,H22,H23,H24,H25,H26,H27,H28)","v":0},0,0,0,0,0,{"$f":"CHOOSE(N30,N5,N6,N7,N8,N9,N10,N11,N12,N13,N14,N15,N16,N17,N18,N19,N20,N21,N22,N23,N24,N25,N26,N27,N28)","v":0},0,0,0,150,322,314,303,396,0,0,0,0,0,0,0,0,0,0,150,0,0,0,0,{"$f":"CHOOSE(AL30,AL5,AL6,AL7,AL8,AL9,AL10,AL11,AL12,AL13,AL14,AL15,AL16,AL17,AL18,AL19,AL20,AL21,AL22,AL23,AL24,AL25,AL26,AL27,AL28)","v":0},0,0,0,0,0,0,0,0,0,150,0,{"$f":"CHOOSE(AX30,AX5,AX6,AX7,AX8,AX9,AX10,AX11,AX12,AX13,AX14,AX15,AX16,AX17,AX18,AX19,AX20,AX21,AX22,AX23,AX24,AX25,AX26,AX27,AX28)","v":0},{"$f":"CHOOSE(AY30,AY5,AY6,AY7,AY8,AY9,AY10,AY11,AY12,AY13,AY14,AY15,AY16,AY17,AY18,AY19,AY20,AY21,AY22,AY23,AY24,AY25,AY26,AY27,AY28)","v":0},{"$f":"CHOOSE(AZ30,AZ5,AZ6,AZ7,AZ8,AZ9,AZ10,AZ11,AZ12,AZ13,AZ14,AZ15,AZ16,AZ17,AZ18,AZ19,AZ20,AZ21,AZ22,AZ23,AZ24,AZ25,AZ26,AZ27,AZ28)","v":0},{"$f":"CHOOSE(BA30,BA5,BA6,BA7,BA8,BA9,BA10,BA11,BA12,BA13,BA14,BA15,BA16,BA17,BA18,BA19,BA20,BA21,BA22,BA23,BA24,BA25,BA26,BA27,BA28)","v":0},0,0,0,0,0,0,0,0,0,{"$f":"CHOOSE(BK30,BK5,BK6,BK7,BK8,BK9,BK10,BK11,BK12,BK13,BK14,BK15,BK16,BK17,BK18,BK19,BK20,BK21,BK22,BK23,BK24,BK25,BK26,BK27,BK28)","v":150},0,0,0,0,0,0,0,0,0,0,0,0,0,0,0,0,150,0,0,0,0,{"$f":"CHOOSE(CG30,CG5,CG6,CG7,CG8,CG9,CG10,CG11,CG12,CG13,CG14,CG15,CG16,CG17,CG18,CG19,CG20,CG21,CG22,CG23,CG24,CG25,CG26,CG27,CG28)","v":0},0,0,0,0,0,0,0,0,0,{"$f":"CHOOSE(CQ30,CQ5,CQ6,CQ7,CQ8,CQ9,CQ10,CQ11,CQ12,CQ13,CQ14,CQ15,CQ16,CQ17,CQ18,CQ19,CQ20,CQ21,CQ22,CQ23,CQ24,CQ25,CQ26,CQ27,CQ28)","v":150},0,0,0,0,0,0,0,0,0,0,0,0,0,0,0,150,327,320,311,390,{"$f":"CHOOSE(DL30,DL5,DL6,DL7,DL8,DL9,DL10,DL11,DL12,DL13,DL14,DL15,DL16,DL17,DL18,DL19,DL20,DL21,DL22,DL23,DL24,DL25,DL26,DL27,DL28)","v":325},284,284,463,463,300,464,368,315,315,150,0,{"$f":"CHOOSE(DX30,DX5,DX6,DX7,DX8,DX9,DX10,DX11,DX12,DX13,DX14,DX15,DX16,DX17,DX18,DX19,DX20,DX21,DX22,DX23,DX24,DX25,DX26,DX27,DX28)","v":0},{"$f":"CHOOSE(DY30,DY5,DY6,DY7,DY8,DY9,DY10,DY11,DY12,DY13,DY14,DY15,DY16,DY17,DY18,DY19,DY20,DY21,DY22,DY23,DY24,DY25,DY26,DY27,DY28)","v":0},{"$f":"CHOOSE(DZ30,DZ5,DZ6,DZ7,DZ8,DZ9,DZ10,DZ11,DZ12,DZ13,DZ14,DZ15,DZ16,DZ17,DZ18,DZ19,DZ20,DZ21,DZ22,DZ23,DZ24,DZ25,DZ26,DZ27,DZ28)","v":0},{"$f":"CHOOSE(EA30,EA5,EA6,EA7,EA8,EA9,EA10,EA11,EA12,EA13,EA14,EA15,EA16,EA17,EA18,EA19,EA20,EA21,EA22,EA23,EA24,EA25,EA26,EA27,EA28)","v":0},0,0,0,0,0,0,0,0,0,150,0,{"$f":"CHOOSE(EM30,EM5,EM6,EM7,EM8,EM9,EM10,EM11,EM12,EM13,EM14,EM15,EM16,EM17,EM18,EM19,EM20,EM21,EM22,EM23,EM24,EM25,EM26,EM27,EM28)","v":0},{"$f":"CHOOSE(EN30,EN5,EN6,EN7,EN8,EN9,EN10,EN11,EN12,EN13,EN14,EN15,EN16,EN17,EN18,EN19,EN20,EN21,EN22,EN23,EN24,EN25,EN26,EN27,EN28)","v":0},{"$f":"CHOOSE(EO30,EO5,EO6,EO7,EO8,EO9,EO10,EO11,EO12,EO13,EO14,EO15,EO16,EO17,EO18,EO19,EO20,EO21,EO22,EO23,EO24,EO25,EO26,EO27,EO28)","v":0},{"$f":"CHOOSE(EP30,EP5,EP6,EP7,EP8,EP9,EP10,EP11,EP12,EP13,EP14,EP15,EP16,EP17,EP18,EP19,EP20,EP21,EP22,EP23,EP24,EP25,EP26,EP27,EP28)","v":330},287,287,0,0,0,0,339,287,287,150,442,{"$f":"CHOOSE(FB30,FB5,FB6,FB7,FB8,FB9,FB10,FB11,FB12,FB13,FB14,FB15,FB16,FB17,FB18,FB19,FB20,FB21,FB22,FB23,FB24,FB25,FB26,FB27,FB28)","v":411},{"$f":"CHOOSE(FC30,FC5,FC6,FC7,FC8,FC9,FC10,FC11,FC12,FC13,FC14,FC15,FC16,FC17,FC18,FC19,FC20,FC21,FC22,FC23,FC24,FC25,FC26,FC27,FC28)","v":398},{"$f":"CHOOSE(FD30,FD5,FD6,FD7,FD8,FD9,FD10,FD11,FD12,FD13,FD14,FD15,FD16,FD17,FD18,FD19,FD20,FD21,FD22,FD23,FD24,FD25,FD26,FD27,FD28)","v":510},{"$f":"CHOOSE(FE30,FE5,FE6,FE7,FE8,FE9,FE10,FE11,FE12,FE13,FE14,FE15,FE16,FE17,FE18,FE19,FE20,FE21,FE22,FE23,FE24,FE25,FE26,FE27,FE28)","v":436},372,372,562,563,364,564,415,350,350,{"$f":"CHOOSE(FO30,FO5,FO6,FO7,FO8,FO9,FO10,FO11,FO12,FO13,FO14,FO15,FO16,FO17,FO18,FO19,FO20,FO21,FO22,FO23,FO24,FO25,FO26,FO27,FO28)","v":150},0,0,0,0,444,376,376,376,0,0,0,0,412,346,346,346,150,434,425,412,521,{"$f":"CHOOSE(GK30,GK5,GK6,GK7,GK8,GK9,GK10,GK11,GK12,GK13,GK14,GK15,GK16,GK17,GK18,GK19,GK20,GK21,GK22,GK23,GK24,GK25,GK26,GK27,GK28)","v":0},377,0,561,562,368,562,0,350,0,150,439,{"$f":"CHOOSE(GW30,GW5,GW6,GW7,GW8,GW9,GW10,GW11,GW12,GW13,GW14,GW15,GW16,GW17,GW18,GW19,GW20,GW21,GW22,GW23,GW24,GW25,GW26,GW27,GW28)","v":432},{"$f":"CHOOSE(GX30,GX5,GX6,GX7,GX8,GX9,GX10,GX11,GX12,GX13,GX14,GX15,GX16,GX17,GX18,GX19,GX20,GX21,GX22,GX23,GX24,GX25,GX26,GX27,GX28)","v":419},{"$f":"CHOOSE(GY30,GY5,GY6,GY7,GY8,GY9,GY10,GY11,GY12,GY13,GY14,GY15,GY16,GY17,GY18,GY19,GY20,GY21,GY22,GY23,GY24,GY25,GY26,GY27,GY28)","v":518},{"$f":"CHOOSE(GZ30,GZ5,GZ6,GZ7,GZ8,GZ9,GZ10,GZ11,GZ12,GZ13,GZ14,GZ15,GZ16,GZ17,GZ18,GZ19,GZ20,GZ21,GZ22,GZ23,GZ24,GZ25,GZ26,GZ27,GZ28)","v":0},400,0,549,549,366,550,0,360,0,150,443,{"$f":"CHOOSE(HL30,HL5,HL6,HL7,HL8,HL9,HL10,HL11,HL12,HL13,HL14,HL15,HL16,HL17,HL18,HL19,HL20,HL21,HL22,HL23,HL24,HL25,HL26,HL27,HL28)","v":437},{"$f":"CHOOSE(HM30,HM5,HM6,HM7,HM8,HM9,HM10,HM11,HM12,HM13,HM14,HM15,HM16,HM17,HM18,HM19,HM20,HM21,HM22,HM23,HM24,HM25,HM26,HM27,HM28)","v":425},{"$f":"CHOOSE(HN30,HN5,HN6,HN7,HN8,HN9,HN10,HN11,HN12,HN13,HN14,HN15,HN16,HN17,HN18,HN19,HN20,HN21,HN22,HN23,HN24,HN25,HN26,HN27,HN28)","v":518},{"$f":"CHOOSE(HO30,HO5,HO6,HO7,HO8,HO9,HO10,HO11,HO12,HO13,HO14,HO15,HO16,HO17,HO18,HO19,HO20,HO21,HO22,HO23,HO24,HO25,HO26,HO27,HO28)","v":0},412,0,543,544,366,544,0,364,0,150,446,{"$f":"CHOOSE(IA30,IA5,IA6,IA7,IA8,IA9,IA10,IA11,IA12,IA13,IA14,IA15,IA16,IA17,IA18,IA19,IA20,IA21,IA22,IA23,IA24,IA25,IA26,IA27,IA28)","v":441},{"$f":"CHOOSE(IB30,IB5,IB6,IB7,IB8,IB9,IB10,IB11,IB12,IB13,IB14,IB15,IB16,IB17,IB18,IB19,IB20,IB21,IB22,IB23,IB24,IB25,IB26,IB27,IB28)","v":429},{"$f":"CHOOSE(IC30,IC5,IC6,IC7,IC8,IC9,IC10,IC11,IC12,IC13,IC14,IC15,IC16,IC17,IC18,IC19,IC20,IC21,IC22,IC23,IC24,IC25,IC26,IC27,IC28)","v":517},{"$f":"CHOOSE(ID30,ID5,ID6,ID7,ID8,ID9,ID10,ID11,ID12,ID13,ID14,ID15,ID16,ID17,ID18,ID19,ID20,ID21,ID22,ID23,ID24,ID25,ID26,ID27,ID28)","v":0},416,0,538,538,367,538,0,364,0,150,448,{"$f":"CHOOSE(IP30,IP5,IP6,IP7,IP8,IP9,IP10,IP11,IP12,IP13,IP14,IP15,IP16,IP17,IP18,IP19,IP20,IP21,IP22,IP23,IP24,IP25,IP26,IP27,IP28)","v":444},{"$f":"CHOOSE(IQ30,IQ5,IQ6,IQ7,IQ8,IQ9,IQ10,IQ11,IQ12,IQ13,IQ14,IQ15,IQ16,IQ17,IQ18,IQ19,IQ20,IQ21,IQ22,IQ23,IQ24,IQ25,IQ26,IQ27,IQ28)","v":432},{"$f":"CHOOSE(IR30,IR5,IR6,IR7,IR8,IR9,IR10,IR11,IR12,IR13,IR14,IR15,IR16,IR17,IR18,IR19,IR20,IR21,IR22,IR23,IR24,IR25,IR26,IR27,IR28)","v":516},{"$f":"CHOOSE(IS30,IS5,IS6,IS7,IS8,IS9,IS10,IS11,IS12,IS13,IS14,IS15,IS16,IS17,IS18,IS19,IS20,IS21,IS22,IS23,IS24,IS25,IS26,IS27,IS28)","v":0},418,0,532,532,366,533,0,364,0,150,451,{"$f":"CHOOSE(JE30,JE5,JE6,JE7,JE8,JE9,JE10,JE11,JE12,JE13,JE14,JE15,JE16,JE17,JE18,JE19,JE20,JE21,JE22,JE23,JE24,JE25,JE26,JE27,JE28)","v":448},{"$f":"CHOOSE(JF30,JF5,JF6,JF7,JF8,JF9,JF10,JF11,JF12,JF13,JF14,JF15,JF16,JF17,JF18,JF19,JF20,JF21,JF22,JF23,JF24,JF25,JF26,JF27,JF28)","v":437},{"$f":"CHOOSE(JG30,JG5,JG6,JG7,JG8,JG9,JG10,JG11,JG12,JG13,JG14,JG15,JG16,JG17,JG18,JG19,JG20,JG21,JG22,JG23,JG24,JG25,JG26,JG27,JG28)","v":510},{"$f":"CHOOSE(JH30,JH5,JH6,JH7,JH8,JH9,JH10,JH11,JH12,JH13,JH14,JH15,JH16,JH17,JH18,JH19,JH20,JH21,JH22,JH23,JH24,JH25,JH26,JH27,JH28)","v":0},419,0,520,521,366,521,0,363,0,150,0,{"$f":"CHOOSE(JT30,JT5,JT6,JT7,JT8,JT9,JT10,JT11,JT12,JT13,JT14,JT15,JT16,JT17,JT18,JT19,JT20,JT21,JT22,JT23,JT24,JT25,JT26,JT27,JT28)","v":0},{"$f":"CHOOSE(JU30,JU5,JU6,JU7,JU8,JU9,JU10,JU11,JU12,JU13,JU14,JU15,JU16,JU17,JU18,JU19,JU20,JU21,JU22,JU23,JU24,JU25,JU26,JU27,JU28)","v":0},{"$f":"CHOOSE(JV30,JV5,JV6,JV7,JV8,JV9,JV10,JV11,JV12,JV13,JV14,JV15,JV16,JV17,JV18,JV19,JV20,JV21,JV22,JV23,JV24,JV25,JV26,JV27,JV28)","v":0},{"$f":"CHOOSE(JW30,JW5,JW6,JW7,JW8,JW9,JW10,JW11,JW12,JW13,JW14,JW15,JW16,JW17,JW18,JW19,JW20,JW21,JW22,JW23,JW24,JW25,JW26,JW27,JW28)","v":0},0,0,0,0,0,0,0,0,0,150,0,{"$f":"CHOOSE(KI30,KI5,KI6,KI7,KI8,KI9,KI10,KI11,KI12,KI13,KI14,KI15,KI16,KI17,KI18,KI19,KI20,KI21,KI22,KI23,KI24,KI25,KI26,KI27,KI28)","v":0},{"$f":"CHOOSE(KJ30,KJ5,KJ6,KJ7,KJ8,KJ9,KJ10,KJ11,KJ12,KJ13,KJ14,KJ15,KJ16,KJ17,KJ18,KJ19,KJ20,KJ21,KJ22,KJ23,KJ24,KJ25,KJ26,KJ27,KJ28)","v":0},{"$f":"CHOOSE(KK30,KK5,KK6,KK7,KK8,KK9,KK10,KK11,KK12,KK13,KK14,KK15,KK16,KK17,KK18,KK19,KK20,KK21,KK22,KK23,KK24,KK25,KK26,KK27,KK28)","v":0},{"$f":"CHOOSE(KL30,KL5,KL6,KL7,KL8,KL9,KL10,KL11,KL12,KL13,KL14,KL15,KL16,KL17,KL18,KL19,KL20,KL21,KL22,KL23,KL24,KL25,KL26,KL27,KL28)","v":0},0,0,0,0,0,0,0,0,0,150,245.98454152914229,{"$f":"CHOOSE(KX30,KX5,KX6,KX7,KX8,KX9,KX10,KX11,KX12,KX13,KX14,KX15,KX16,KX17,KX18,KX19,KX20,KX21,KX22,KX23,KX24,KX25,KX26,KX27,KX28)","v":239.09891586122723},{"$f":"CHOOSE(KY30,KY5,KY6,KY7,KY8,KY9,KY10,KY11,KY12,KY13,KY14,KY15,KY16,KY17,KY18,KY19,KY20,KY21,KY22,KY23,KY24,KY25,KY26,KY27,KY28)","v":231.399394339872},{"$f":"CHOOSE(KZ30,KZ5,KZ6,KZ7,KZ8,KZ9,KZ10,KZ11,KZ12,KZ13,KZ14,KZ15,KZ16,KZ17,KZ18,KZ19,KZ20,KZ21,KZ22,KZ23,KZ24,KZ25,KZ26,KZ27,KZ28)","v":301.58109308336964},{"$f":"CHOOSE(LA30,LA5,LA6,LA7,LA8,LA9,LA10,LA11,LA12,LA13,LA14,LA15,LA16,LA17,LA18,LA19,LA20,LA21,LA22,LA23,LA24,LA25,LA26,LA27,LA28)","v":0},0,0,0,0,0,0,0,0,0,150,239.22865604283828,{"$f":"CHOOSE(LM30,LM5,LM6,LM7,LM8,LM9,LM10,LM11,LM12,LM13,LM14,LM15,LM16,LM17,LM18,LM19,LM20,LM21,LM22,LM23,LM24,LM25,LM26,LM27,LM28)","v":231.90330363214946},{"$f":"CHOOSE(LN30,LN5,LN6,LN7,LN8,LN9,LN10,LN11,LN12,LN13,LN14,LN15,LN16,LN17,LN18,LN19,LN20,LN21,LN22,LN23,LN24,LN25,LN26,LN27,LN28)","v":224.48384873038069},{"$f":"CHOOSE(LO30,LO5,LO6,LO7,LO8,LO9,LO10,LO11,LO12,LO13,LO14,LO15,LO16,LO17,LO18,LO19,LO20,LO21,LO22,LO23,LO24,LO25,LO26,LO27,LO28)","v":293.70421799729814},{"$f":"CHOOSE(LP30,LP5,LP6,LP7,LP8,LP9,LP10,LP11,LP12,LP13,LP14,LP15,LP16,LP17,LP18,LP19,LP20,LP21,LP22,LP23,LP24,LP25,LP26,LP27,LP28)","v":0},0,0,0,0,0,0,0,0,0,150,0,{"$f":"CHOOSE(MB30,MB5,MB6,MB7,MB8,MB9,MB10,MB11,MB12,MB13,MB14,MB15,MB16,MB17,MB18,MB19,MB20,MB21,MB22,MB23,MB24,MB25,MB26,MB27,MB28)","v":0},{"$f":"CHOOSE(MC30,MC5,MC6,MC7,MC8,MC9,MC10,MC11,MC12,MC13,MC14,MC15,MC16,MC17,MC18,MC19,MC20,MC21,MC22,MC23,MC24,MC25,MC26,MC27,MC28)","v":0},{"$f":"CHOOSE(MD30,MD5,MD6,MD7,MD8,MD9,MD10,MD11,MD12,MD13,MD14,MD15,MD16,MD17,MD18,MD19,MD20,MD21,MD22,MD23,MD24,MD25,MD26,MD27,MD28)","v":405},{"$f":"CHOOSE(ME30,ME5,ME6,ME7,ME8,ME9,ME10,ME11,ME12,ME13,ME14,ME15,ME16,ME17,ME18,ME19,ME20,ME21,ME22,ME23,ME24,ME25,ME26,ME27,ME28)","v":0},0,0,0,0,0,0,0,0,0,150,0,{"$f":"CHOOSE(MQ30,MQ5,MQ6,MQ7,MQ8,MQ9,MQ10,MQ11,MQ12,MQ13,MQ14,MQ15,MQ16,MQ17,MQ18,MQ19,MQ20,MQ21,MQ22,MQ23,MQ24,MQ25,MQ26,MQ27,MQ28)","v":0},{"$f":"CHOOSE(MR30,MR5,MR6,MR7,MR8,MR9,MR10,MR11,MR12,MR13,MR14,MR15,MR16,MR17,MR18,MR19,MR20,MR21,MR22,MR23,MR24,MR25,MR26,MR27,MR28)","v":0},{"$f":"CHOOSE(MS30,MS5,MS6,MS7,MS8,MS9,MS10,MS11,MS12,MS13,MS14,MS15,MS16,MS17,MS18,MS19,MS20,MS21,MS22,MS23,MS24,MS25,MS26,MS27,MS28)","v":402},{"$f":"CHOOSE(MT30,MT5,MT6,MT7,MT8,MT9,MT10,MT11,MT12,MT13,MT14,MT15,MT16,MT17,MT18,MT19,MT20,MT21,MT22,MT23,MT24,MT25,MT26,MT27,MT28)","v":0},0,0,0,0,0,0,0,0,0,150,0,{"$f":"CHOOSE(NF30,NF5,NF6,NF7,NF8,NF9,NF10,NF11,NF12,NF13,NF14,NF15,NF16,NF17,NF18,NF19,NF20,NF21,NF22,NF23,NF24,NF25,NF26,NF27,NF28)","v":0},{"$f":"CHOOSE(NG30,NG5,NG6,NG7,NG8,NG9,NG10,NG11,NG12,NG13,NG14,NG15,NG16,NG17,NG18,NG19,NG20,NG21,NG22,NG23,NG24,NG25,NG26,NG27,NG28)","v":0},{"$f":"CHOOSE(NH30,NH5,NH6,NH7,NH8,NH9,NH10,NH11,NH12,NH13,NH14,NH15,NH16,NH17,NH18,NH19,NH20,NH21,NH22,NH23,NH24,NH25,NH26,NH27,NH28)","v":464},{"$f":"CHOOSE(NI30,NI5,NI6,NI7,NI8,NI9,NI10,NI11,NI12,NI13,NI14,NI15,NI16,NI17,NI18,NI19,NI20,NI21,NI22,NI23,NI24,NI25,NI26,NI27,NI28)","v":0},0,0,0,0,0,0,0,0,0,150,325,{"$f":"CHOOSE(NU30,NU5,NU6,NU7,NU8,NU9,NU10,NU11,NU12,NU13,NU14,NU15,NU16,NU17,NU18,NU19,NU20,NU21,NU22,NU23,NU24,NU25,NU26,NU27,NU28)","v":317},{"$f":"CHOOSE(NV30,NV5,NV6,NV7,NV8,NV9,NV10,NV11,NV12,NV13,NV14,NV15,NV16,NV17,NV18,NV19,NV20,NV21,NV22,NV23,NV24,NV25,NV26,NV27,NV28)","v":308},{"$f":"CHOOSE(NW30,NW5,NW6,NW7,NW8,NW9,NW10,NW11,NW12,NW13,NW14,NW15,NW16,NW17,NW18,NW19,NW20,NW21,NW22,NW23,NW24,NW25,NW26,NW27,NW28)","v":393},{"$f":"CHOOSE(NX30,NX5,NX6,NX7,NX8,NX9,NX10,NX11,NX12,NX13,NX14,NX15,NX16,NX17,NX18,NX19,NX20,NX21,NX22,NX23,NX24,NX25,NX26,NX27,NX28)","v":337},288,288,435,436,282,436,322,271,271,150,0,{"$f":"CHOOSE(OJ30,OJ5,OJ6,OJ7,OJ8,OJ9,OJ10,OJ11,OJ12,OJ13,OJ14,OJ15,OJ16,OJ17,OJ18,OJ19,OJ20,OJ21,OJ22,OJ23,OJ24,OJ25,OJ26,OJ27,OJ28)","v":0},{"$f":"CHOOSE(OK30,OK5,OK6,OK7,OK8,OK9,OK10,OK11,OK12,OK13,OK14,OK15,OK16,OK17,OK18,OK19,OK20,OK21,OK22,OK23,OK24,OK25,OK26,OK27,OK28)","v":0},{"$f":"CHOOSE(OL30,OL5,OL6,OL7,OL8,OL9,OL10,OL11,OL12,OL13,OL14,OL15,OL16,OL17,OL18,OL19,OL20,OL21,OL22,OL23,OL24,OL25,OL26,OL27,OL28)","v":0},{"$f":"CHOOSE(OM30,OM5,OM6,OM7,OM8,OM9,OM10,OM11,OM12,OM13,OM14,OM15,OM16,OM17,OM18,OM19,OM20,OM21,OM22,OM23,OM24,OM25,OM26,OM27,OM28)","v":0},0,0,0,0,0,0,0,0,0]
[null,null,"check Condition",{"$f":"IF(B48=\"Air\",D31,0)","v":318},{"$f":"IF(E33=\"Air\",E31,0)","v":309},299,391,0,0,0,{"$f":"IF(K33=\"Ground\",K31,0)","v":0},0,0,0,0,0,0,0,{"$f":"IF(S33=\"Air\",S31,0)","v":322},314,303,396,0,0,0,{"$f":"IF(Z33=\"Ground\",Z31,0)","v":0},0,0,0,0,0,0,0,{"$f":"IF(AH33=\"Air\",AH31,0)","v":0},0,0,0,0,0,0,{"$f":"IF(AO33=\"Ground\",AO31,0)","v":0},0,0,0,0,0,0,0,{"$f":"IF(AW33=\"Air\",AW31,0)","v":0},0,0,0,0,0,0,{"$f":"IF(BD33=\"Ground\",BD31,0)","v":0},0,0,0,0,0,0,{"$f":"IF(BK33=\"Ground\",BK31,0)","v":0},{"$f":"IF(BL33=\"Air\",BL31,0)","v":0},0,0,0,0,0,0,0,{"$f":"IF(BT33=\"Ground\",BT31,0)","v":0},0,0,0,0,0,0,0,0,{"$f":"IF(CC33=\"Air\",CC31,0)","v":0},0,0,0,0,0,0,{"$f":"IF(CJ33=\"Ground\",CJ31,0)","v":0},0,0,0,0,0,0,{"$f":"IF(CQ33=\"Ground\",CQ31,0)","v":0},{"$f":"IF(CR33=\"Air\",CR31,0)","v":0},0,0,0,0,0,0,0,{"$f":"IF(CZ33=\"Ground\",CZ31,0)","v":0},0,0,0,0,0,0,0,{"$f":"IF(DH33=\"Air\",DH31,0)","v":327},320,311,390,325,284,284,{"$f":"IF(DO33=\"Ground\",DO31,0)","v":0},0,0,0,0,0,0,0,{"$f":"IF(DW33=\"Air\",DW31,0)","v":0},0,0,0,0,0,0,{"$f":"IF(ED33=\"Ground\",ED31,0)","v":0},0,0,0,0,0,0,0,{"$f":"IF(EL33=\"Air\",EL31,0)","v":0},0,0,0,330,287,287,{"$f":"IF(ES33=\"Ground\",ES31,0)","v":0},0,0,0,0,0,0,0,{"$f":"IF(FA33=\"Air\",FA31,0)","v":442},411,398,510,436,372,372,{"$f":"IF(FH33=\"Ground\",FH31,0)","v":0},0,0,0,0,0,0,{"$f":"IF(FO33=\"Ground\",FO31,0)","v":0},{"$f":"IF(FP33=\"Air\",FP31,0)","v":0},0,0,0,444,376,376,376,{"$f":"IF(FX33=\"Ground\",FX31,0)","v":0},0,0,0,0,0,0,0,0,{"$f":"IF(GG33=\"Air\",GG31,0)","v":434},425,412,521,0,377,0,{"$f":"IF(GN33=\"Ground\",GN31,0)","v":0},0,0,0,0,0,0,0,{"$f":"IF(GV33=\"Air\",GV31,0)","v":439},432,419,518,0,400,0,{"$f":"IF(HC33=\"Ground\",HC31,0)","v":0},0,0,0,0,0,0,0,{"$f":"IF(HK33=\"Air\",HK31,0)","v":443},437,425,518,0,412,0,{"$f":"IF(HR33=\"Ground\",HR31,0)","v":0},0,0,0,0,0,0,0,{"$f":"IF(HZ33=\"Air\",HZ31,0)","v":446},441,429,517,0,416,0,{"$f":"IF(IG33=\"Ground\",IG31,0)","v":0},0,0,0,0,0,0,0,{"$f":"IF(IO33=\"Air\",IO31,0)","v":448},444,432,516,0,418,0,{"$f":"IF(IV33=\"Ground\",IV31,0)","v":0},0,0,0,0,0,0,0,{"$f":"IF(JD33=\"Air\",JD31,0)","v":451},448,437,510,0,419,0,{"$f":"IF(JK33=\"Ground\",JK31,0)","v":0},0,0,0,0,0,0,0,{"$f":"IF(JS33=\"Air\",JS31,0)","v":0},0,0,0,0,0,0,{"$f":"IF(JZ33=\"Ground\",JZ31,0)","v":0},0,0,0,0,0,0,0,{"$f":"IF(KH33=\"Air\",KH31,0)","v":0},0,0,0,0,0,0,{"$f":"IF(KO33=\"Ground\",KO31,0)","v":0},0,0,0,0,0,0,0,{"$f":"IF(KW33=\"Air\",KW31,0)","v":245.98454152914229},239.09891586122723,231.399394339872,301.58109308336964,0,0,0,{"$f":"IF(LD33=\"Ground\",LD31,0)","v":0},0,0,0,0,0,0,0,{"$f":"IF(LL33=\"Air\",LL31,0)","v":239.22865604283828},231.90330363214946,224.48384873038069,293.70421799729814,0,0,0,{"$f":"IF(LS33=\"Ground\",LS31,0)","v":0},0,0,0,0,0,0,0,{"$f":"IF(MA33=\"Air\",MA31,0)","v":0},0,0,405,0,0,0,{"$f":"IF(MH33=\"Ground\",MH31,0)","v":0},0,0,0,0,0,0,0,{"$f":"IF(MP33=\"Air\",MP31,0)","v":0},0,0,402,0,0,0,{"$f":"IF(MW33=\"Ground\",MW31,0)","v":0},0,0,0,0,0,0,0,{"$f":"IF(NE33=\"Air\",NE31,0)","v":0},0,0,464,0,0,0,{"$f":"IF(NL33=\"Ground\",NL31,0)","v":0},0,0,0,0,0,0,0,{"$f":"IF(NT33=\"Air\",NT31,0)","v":325},317,308,393,337,288,288,{"$f":"IF(OA33=\"Ground\",OA31,0)","v":0},0,0,0,0,0,0,0,{"$f":"IF(OI33=\"Air\",OI31,0)","v":0},0,0,0,0,0,0,{"$f":"IF(OP33=\"Ground\",OP31,0)","v":0},0,0,0,0,0,0]
[null,null,null,{"$f":"B48","v":"Air"},{"$f":"D33","v":"Air"},{"$f":"E33","v":"Air"},{"$f":"F33","v":"Air"},{"$f":"G33","v":"Air"},"Air","Air","Air","Air","Air",{"$f":"M33","v":"Air"},"Air","Air","Air","Air","Air","Air","Air","Air",{"$f":"V33","v":"Air"},"Air","Air","Air","Air","Air","Air","Air","Air","Air",{"$f":"AF33","v":"Air"},"Air","Air","Air","Air","Air","Air","Air","Air","Air","Air","Air","Air","Air","Air","Air","Air","Air","Air","Air","Air","Air","Air","Air","Air","Air","Air","Air","Air","Air",{"$f":"BJ33","v":"Air"},"Air","Air","Air","Air","Air","Air","Air","Air",{"$f":"BR33","v":"Air"},"Air","Air","Air","Air","Air","Air",{"$f":"BZ33","v":"Air"},"Air","Air","Air","Air","Air","Air","Air","Air","Air","Air","Air","Air","Air","Air","Air","Air","Air","Air","Air","Air","Air","Air","Air","Air",{"$f":"CX33","v":"Air"},{"$f":"CZ33","v":"Air"},"Air","Air","Air","Air","Air",{"$f":"DF33","v":"Air"},"Air","Air","Air","Air","Air","Air","Air","Air","Air","Air","Air","Air","Air","Air","Air","Air","Air","Air","Air","Air","Air","Air","Air","Air","Air","Air","Air","Air","Air","Air","Air",{"$f":"EL33","v":"Air"},"Air","Air","Air","Air","Air","Air","Air","Air","Air","Air","Air","Air","Air","Air","Air","Air","Air","Air","Air","Air","Air","Air","Air","Air","Air","Air","Air",{"$f":"FN33","v":"Air"},"Air","Air","Air","Air","Air","Air","Air",{"$f":"FV33","v":"Air"},{"$f":"FV33","v":"Air"},"Air","Air","Air","Air","Air","Air",{"$f":"GD33","v":"Air"},"Air","Air","Air","Air","Air","Air","Air","Air","Air","Air","Air","Air","Air","Air","Air","Air","Air","Air","Air","Air","Air","Air","Air","Air","Air","Air","Air","Air","Air","Air","Air",{"$f":"HJ33","v":"Air"},"Air","Air","Air","Air","Air","Air","Air","Air","Air","Air","Air","Air","Air","Air","Air","Air","Air","Air","Air","Air","Air","Air","Air","Air","Air","Air","Air","Air","Air","Air","Air",{"$f":"IP33","v":"Air"},"Air","Air","Air","Air","Air","Air","Air","Air","Air","Air","Air","Air","Air","Air","Air","Air","Air","Air","Air","Air","Air","Air","Air","Air","Air","Air","Air","Air","Air","Air","Air",{"$f":"JV33","v":"Air"},"Air","Air","Air","Air","Air","Air","Air","Air","Air","Air","Air","Air","Air","Air","Air","Air","Air","Air","Air","Air","Air","Air","Air","Air","Air","Air","Air","Air","Air","Air","Air",{"$f":"LB33","v":"Air"},"Air","Air","Air","Air","Air","Air","Air","Air","Air","Air","Air","Air","Air","Air","Air","Air","Air","Air","Air","Air","Air","Air","Air","Air","Air","Air","Air","Air","Air","Air","Air",{"$f":"MH33","v":"Air"},"Air","Air","Air","Air","Air","Air","Air","Air","Air","Air","Air","Air","Air","Air","Air","Air","Air","Air","Air","Air","Air","Air","Air","Air","Air","Air","Air","Air","Air","Air","Air","Air","Air","Air","Air",{"$f":"NR33","v":"Air"},{"$f":"NS33","v":"Air"},{"$f":"NT33","v":"Air"},{"$f":"NU33","v":"Air"},{"$f":"NV33","v":"Air"},{"$f":"NW33","v":"Air"},{"$f":"NX33","v":"Air"},{"$f":"NY33","v":"Air"},{"$f":"NZ33","v":"Air"},{"$f":"OA33","v":"Air"},{"$f":"OB33","v":"Air"},{"$f":"OC33","v":"Air"},{"$f":"OD33","v":"Air"},{"$f":"OE33","v":"Air"},{"$f":"OF33","v":"Air"},{"$f":"OG33","v":"Air"},{"$f":"OH33","v":"Air"},{"$f":"OI33","v":"Air"},{"$f":"OJ33","v":"Air"},{"$f":"OK33","v":"Air"},{"$f":"OL33","v":"Air"},{"$f":"OM33","v":"Air"},{"$f":"ON33","v":"Air"},{"$f":"OO33","v":"Air"},{"$f":"OP33","v":"Air"},{"$f":"OQ33","v":"Air"},{"$f":"OR33","v":"Air"},{"$f":"OS33","v":"Air"},{"$f":"OT33","v":"Air"},{"$f":"OU33","v":"Air"}]
[null,null,"A",{"$f":"IF(D33=\"air\",D31,0)","v":318},309,299,391,0,0,0,{"$f":"IF(K33=\"Ground\",K31,0)","v":0},0,0,0,0,0,0,0,{"$f":"IF(S33=\"Air\",S31,0)","v":322},{"$f":"IF(T33=\"air\",T31,0)","v":314},303,396,0,0,0,{"$f":"IF(Z33=\"Ground\",Z31,0)","v":0},0,0,0,0,0,0,0,{"$f":"IF(AH33=\"Air\",AH31,0)","v":0},{"$f":"IF(AI33=\"air\",AI31,0)","v":0},0,0,0,0,0,{"$f":"IF(AO33=\"Ground\",AO31,0)","v":0},0,0,0,0,0,0,0,{"$f":"IF(AW33=\"Air\",AW31,0)","v":0},{"$f":"IF(AX33=\"air\",AX31,0)","v":0},0,0,0,0,0,{"$f":"IF(BD33=\"Ground\",BD31,0)","v":0},0,0,0,0,0,0,{"$f":"IF(BK33=\"Ground\",BK31,0)","v":0},{"$f":"IF(BL33=\"Air\",BL31,0)","v":0},{"$f":"IF(BM33=\"air\",BM31,0)","v":0},0,0,0,0,0,0,{"$f":"IF(BT33=\"Ground\",BT31,0)","v":0},0,0,0,0,0,0,0,0,{"$f":"IF(CC33=\"Air\",CC31,0)","v":0},{"$f":"IF(CD33=\"air\",CD31,0)","v":0},0,0,0,0,0,{"$f":"IF(CJ33=\"Ground\",CJ31,0)","v":0},0,0,0,0,0,0,{"$f":"IF(CQ33=\"Ground\",CQ31,0)","v":0},{"$f":"IF(CR33=\"Air\",CR31,0)","v":0},{"$f":"IF(CS33=\"air\",CS31,0)","v":0},0,0,0,0,0,0,{"$f":"IF(CZ33=\"Ground\",CZ31,0)","v":0},0,0,0,0,0,0,0,{"$f":"IF(DH33=\"Air\",DH31,0)","v":327},{"$f":"IF(DI33=\"air\",DI31,0)","v":320},311,390,325,284,284,{"$f":"IF(DO33=\"Ground\",DO31,0)","v":0},0,0,0,0,0,0,0,{"$f":"IF(DW33=\"Air\",DW31,0)","v":0},{"$f":"IF(DX33=\"air\",DX31,0)","v":0},0,0,0,0,0,{"$f":"IF(ED33=\"Ground\",ED31,0)","v":0},0,0,0,0,0,0,0,{"$f":"IF(EL33=\"Air\",EL31,0)","v":0},{"$f":"IF(EM33=\"air\",EM31,0)","v":0},0,0,330,287,287,{"$f":"IF(ES33=\"Ground\",ES31,0)","v":0},0,0,0,0,0,0,0,{"$f":"IF(FA33=\"Air\",FA31,0)","v":442},{"$f":"IF(FB33=\"air\",FB31,0)","v":411},398,510,436,372,372,{"$f":"IF(FH33=\"Ground\",FH31,0)","v":0},0,0,0,0,0,0,{"$f":"IF(FO33=\"Ground\",FO31,0)","v":0},{"$f":"IF(FP33=\"Air\",FP31,0)","v":0},{"$f":"IF(FQ33=\"air\",FQ31,0)","v":0},0,0,444,376,376,376,{"$f":"IF(FX33=\"Ground\",FX31,0)","v":0},0,0,0,0,0,0,0,0,{"$f":"IF(GG33=\"Air\",GG31,0)","v":434},{"$f":"IF(GH33=\"air\",GH31,0)","v":425},412,521,0,377,0,{"$f":"IF(GN33=\"Ground\",GN31,0)","v":0},0,0,0,0,0,0,0,{"$f":"IF(GV33=\"Air\",GV31,0)","v":439},{"$f":"IF(GW33=\"air\",GW31,0)","v":432},419,518,0,400,0,{"$f":"IF(HC33=\"Ground\",HC31,0)","v":0},0,0,0,0,0,0,0,{"$f":"IF(HK33=\"Air\",HK31,0)","v":443},{"$f":"IF(HL33=\"air\",HL31,0)","v":437},425,518,0,412,0,{"$f":"IF(HR33=\"Ground\",HR31,0)","v":0},0,0,0,0,0,0,0,{"$f":"IF(HZ33=\"Air\",HZ31,0)","v":446},{"$f":"IF(IA33=\"air\",IA31,0)","v":441},429,517,0,416,0,{"$f":"IF(IG33=\"Ground\",IG31,0)","v":0},0,0,0,0,0,0,0,{"$f":"IF(IO33=\"Air\",IO31,0)","v":448},{"$f":"IF(IP33=\"air\",IP31,0)","v":444},432,516,0,418,0,{"$f":"IF(IV33=\"Ground\",IV31,0)","v":0},0,0,0,0,0,0,0,{"$f":"IF(JD33=\"Air\",JD31,0)","v":451},{"$f":"IF(JE33=\"air\",JE31,0)","v":448},437,510,0,419,0,{"$f":"IF(JK33=\"Ground\",JK31,0)","v":0},0,0,0,0,0,0,0,{"$f":"IF(JS33=\"Air\",JS31,0)","v":0},{"$f":"IF(JT33=\"air\",JT31,0)","v":0},0,0,0,0,0,{"$f":"IF(JZ33=\"Ground\",JZ31,0)","v":0},0,0,{"$f":"IF(KC33=\"Ground\",KC31,0)","v":0},0,0,0,0,{"$f":"IF(KH33=\"Air\",KH31,0)","v":0},{"$f":"IF(KI33=\"air\",KI31,0)","v":0},0,0,0,0,0,{"$f":"IF(KO33=\"Ground\",KO31,0)","v":0},0,0,0,0,0,0,0,{"$f":"IF(KW33=\"Air\",KW31,0)","v":245.98454152914229},{"$f":"IF(KX33=\"air\",KX31,0)","v":239.09891586122723},231.399394339872,301.58109308336964,0,0,0,{"$f":"IF(LD33=\"Ground\",LD31,0)","v":0},0,0,0,0,0,0,0,{"$f":"IF(LL33=\"Air\",LL31,0)","v":239.22865604283828},{"$f":"IF(LM33=\"air\",LM31,0)","v":231.90330363214946},224.48384873038069,293.70421799729814,0,0,0,{"$f":"IF(LS33=\"Ground\",LS31,0)","v":0},0,0,0,0,0,0,0,{"$f":"IF(MA33=\"Air\",MA31,0)","v":0},{"$f":"IF(MB33=\"air\",MB31,0)","v":0},0,405,0,0,0,{"$f":"IF(MH33=\"Ground\",MH31,0)","v":0},0,0,0,0,0,0,0,{"$f":"IF(MP33=\"Air\",MP31,0)","v":0},{"$f":"IF(MQ33=\"air\",MQ31,0)","v":0},0,402,0,0,0,{"$f":"IF(MW33=\"Ground\",MW31,0)","v":0},0,0,0,0,0,0,0,{"$f":"IF(NE33=\"Air\",NE31,0)","v":0},{"$f":"IF(NF33=\"air\",NF31,0)","v":0},0,464,0,0,0,{"$f":"IF(NL33=\"Ground\",NL31,0)","v":0},0,0,0,0,0,0,0,{"$f":"IF(NT33=\"Air\",NT31,0)","v":325},{"$f":"IF(NU33=\"air\",NU31,0)","v":317},308,393,337,288,288,{"$f":"IF(OA33=\"Ground\",OA31,0)","v":0},0,0,0,0,0,0,0,{"$f":"IF(OI33=\"Air\",OI31,0)","v":0},{"$f":"IF(OJ33=\"air\",OJ31,0)","v":0},0,0,0,0,0,{"$f":"IF(OP33=\"Ground\",OP31,0)","v":0},0,0,0,0,0,0]
[null,null,null,{"$f":"IF(B45=2,2,IF(B45=3,3,IF(B45=4,4,IF(B45=5,5,C47))))","v":"Space"},{"$f":"D35","v":"Space"},"Space","Space","Space","Space","Space",{"$f":"J35","v":"Space"},"Space","Space","Space","Space","Space","Space",{"$f":"Q35","v":"Space"},{"$f":"R35","v":"Space"},{"$f":"S35","v":"Space"},"Space","Space","Space","Space","Space",{"$f":"Y35","v":"Space"},"Space","Space","Space","Space","Space","Space",{"$f":"AF35","v":"Space"},"Space","Space","Space","Space","Space","Space","Space","Space","Space","Space","Space","Space","Space","Space","Space","Space","Space","Space","Space","Space","Space","Space","Space","Space","Space","Space","Space","Space","Space",{"$f":"BJ35","v":"Space"},"Space","Space","Space","Space","Space","Space","Space","Space",{"$f":"BR35","v":"Space"},"Space","Space","Space","Space","Space","Space",{"$f":"BZ35","v":"Space"},"Space","Space","Space","Space","Space","Space","Space","Space","Space","Space","Space","Space","Space","Space","Space","Space","Space","Space","Space","Space","Space","Space","Space","Space",{"$f":"CX35","v":"Space"},"Space","Space","Space",{"$f":"DC35","v":"Space"},"Space","Space","Space","Space","Space","Space","Space","Space","Space","Space","Space","Space","Space","Space","Space","Space","Space","Space","Space","Space","Space","Space","Space","Space","Space","Space","Space","Space","Space","Space","Space",{"$f":"EI35","v":"Space"},"Space","Space","Space","Space","Space","Space","Space","Space","Space","Space","Space","Space","Space","Space","Space","Space","Space","Space","Space","Space","Space","Space","Space","Space","Space","Space","Space","Space","Space","Space","Space",{"$f":"FO35","v":"Space"},"Space","Space","Space","Space","Space","Space",{"$f":"FV35","v":"Space"},{"$f":"FV35","v":"Space"},"Space","Space","Space","Space","Space","Space",{"$f":"GD35","v":"Space"},"Space","Space","Space","Space","Space","Space","Space","Space","Space","Space","Space","Space","Space","Space","Space","Space","Space","Space","Space","Space","Space","Space","Space","Space","Space","Space","Space","Space","Space","Space","Space",{"$f":"HJ35","v":"Space"},"Space","Space","Space","Space","Space","Space","Space","Space","Space","Space","Space","Space","Space","Space","Space","Space","Space","Space","Space","Space","Space","Space","Space","Space","Space","Space","Space","Space","Space","Space","Space",{"$f":"IP35","v":"Space"},"Space","Space","Space","Space","Space","Space","Space","Space","Space","Space","Space","Space","Space","Space","Space","Space","Space","Space","Space","Space","Space","Space","Space","Space","Space","Space","Space","Space","Space","Space","Space",{"$f":"JV35","v":"Space"},"Space","Space","Space","Space","Space","Space","Space","Space","Space","Space","Space","Space","Space","Space","Space","Space","Space","Space","Space","Space","Space","Space","Space","Space","Space","Space","Space","Space","Space","Space","Space",{"$f":"LB35","v":"Space"},"Space","Space","Space","Space","Space","Space","Space","Space","Space","Space","Space","Space","Space","Space","Space","Space","Space","Space","Space","Space","Space","Space","Space","Space","Space","Space","Space","Space","Space","Space","Space",{"$f":"MH35","v":"Space"},"Space","Space","Space","Space","Space","Space","Space","Space","Space","Space","Space","Space","Space","Space","Space","Space","Space","Space","Space","Space","Space","Space","Space","Space","Space","Space","Space","Space","Space","Space","Space","Space","Space","Space","Space",{"$f":"NR35","v":"Space"},{"$f":"NS35","v":"Space"},{"$f":"NT35","v":"Space"},{"$f":"NU35","v":"Space"},{"$f":"NV35","v":"Space"},{"$f":"NW35","v":"Space"},{"$f":"NX35","v":"Space"},{"$f":"NY35","v":"Space"},{"$f":"NZ35","v":"Space"},{"$f":"OA35","v":"Space"},{"$f":"OB35","v":"Space"},{"$f":"OC35","v":"Space"},{"$f":"OD35","v":"Space"},{"$f":"OE35","v":"Space"},{"$f":"OF35","v":"Space"},{"$f":"OG35","v":"Space"},{"$f":"OH35","v":"Space"},{"$f":"OI35","v":"Space"},{"$f":"OJ35","v":"Space"},{"$f":"OK35","v":"Space"},{"$f":"OL35","v":"Space"},{"$f":"OM35","v":"Space"},{"$f":"ON35","v":"Space"},{"$f":"OO35","v":"Space"},{"$f":"OP35","v":"Space"},{"$f":"OQ35","v":"Space"},{"$f":"OR35","v":"Space"},{"$f":"OS35","v":"Space"},{"$f":"OT35","v":"Space"},{"$f":"OU35","v":"Space"}]
[null,null,null,{"$f":"IF(C47=\"Touching2\",D34,0)","v":0},{"$f":"IF(E35=\"Touching3\",E34,0)","v":0},{"$f":"IF(F35=\"Trefoil\",F34,0)","v":0},{"$f":"IF(G35=\"Space\",G34,0)","v":391},{"$f":"IF(H35=2,H34,0)","v":0},{"$f":"IF(I35=3,I34,0)","v":0},{"$f":"IF(J35=4,J34,0)","v":0},{"$f":"IF(K35=\"Touching2\",K34,0)","v":0},{"$f":"IF(L35=\"Touching3\",L34,0)","v":0},{"$f":"IF(M35=\"Trefoil\",M34,0)","v":0},{"$f":"IF(N35=\"Space\",N34,0)","v":0},{"$f":"IF(O35=2,O34,0)","v":0},{"$f":"IF(P35=3,P34,0)","v":0},{"$f":"IF(Q35=4,Q34,0)","v":0},{"$f":"IF(R35=4,R34,0)","v":0},{"$f":"IF(S35=\"Touching2\",S34,0)","v":0},{"$f":"IF(T35=\"Touching3\",T34,0)","v":0},{"$f":"IF(U35=\"Trefoil\",U34,0)","v":0},{"$f":"IF(V35=\"Space\",V34,0)","v":396},{"$f":"IF(W35=2,W34,0)","v":0},{"$f":"IF(X35=3,X34,0)","v":0},{"$f":"IF(Y35=4,Y34,0)","v":0},{"$f":"IF(Z35=\"Touching2\",Z34,0)","v":0},{"$f":"IF(AA35=\"Touching3\",AA34,0)","v":0},{"$f":"IF(AB35=\"Trefoil\",AB34,0)","v":0},{"$f":"IF(AC35=\"Space\",AC34,0)","v":0},{"$f":"IF(AD35=2,AD34,0)","v":0},{"$f":"IF(AE35=3,AE34,0)","v":0},{"$f":"IF(AF35=4,AF34,0)","v":0},{"$f":"IF(AG35=4,AG34,0)","v":0},{"$f":"IF(AH35=\"Touching2\",AH34,0)","v":0},{"$f":"IF(AI35=\"Touching3\",AI34,0)","v":0},{"$f":"IF(AJ35=\"Trefoil\",AJ34,0)","v":0},{"$f":"IF(AK35=\"Space\",AK34,0)","v":0},{"$f":"IF(AL35=2,AL34,0)","v":0},{"$f":"IF(AM35=3,AM34,0)","v":0},{"$f":"IF(AN35=4,AN34,0)","v":0},{"$f":"IF(AO35=\"Touching2\",AO34,0)","v":0},{"$f":"IF(AP35=\"Touching3\",AP34,0)","v":0},{"$f":"IF(AQ35=\"Trefoil\",AQ34,0)","v":0},{"$f":"IF(AR35=\"Space\",AR34,0)","v":0},{"$f":"IF(AS35=2,AS34,0)","v":0},{"$f":"IF(AT35=3,AT34,0)","v":0},{"$f":"IF(AU35=4,AU34,0)","v":0},{"$f":"IF(AV35=4,AV34,0)","v":0},{"$f":"IF(AW35=\"Touching2\",AW34,0)","v":0},{"$f":"IF(AX35=\"Touching3\",AX34,0)","v":0},{"$f":"IF(AY35=\"Trefoil\",AY34,0)","v":0},{"$f":"IF(AZ35=\"Space\",AZ34,0)","v":0},{"$f":"IF(BA35=2,BA34,0)","v":0},{"$f":"IF(BB35=3,BB34,0)","v":0},{"$f":"IF(BC35=4,BC34,0)","v":0},{"$f":"IF(BD35=\"Touching2\",BD34,0)","v":0},{"$f":"IF(BE35=\"Touching3\",BE34,0)","v":0},{"$f":"IF(BF35=\"Trefoil\",BF34,0)","v":0},{"$f":"IF(BG35=\"Space\",BG34,0)","v":0},{"$f":"IF(BH35=2,BH34,0)","v":0},{"$f":"IF(BI35=3,BI34,0)","v":0},{"$f":"IF(BJ35=4,BJ34,0)","v":0},{"$f":"IF(BK35=4,BK34,0)","v":0},{"$f":"IF(BL35=\"Touching2\",BL34,0)","v":0},{"$f":"IF(BM35=\"Touching3\",BM34,0)","v":0},{"$f":"IF(BN35=\"Trefoil\",BN34,0)","v":0},{"$f":"IF(BO35=\"Space\",BO34,0)","v":0},{"$f":"IF(BP35=2,BP34,0)","v":0},{"$f":"IF(BQ35=3,BQ34,0)","v":0},{"$f":"IF(BR35=4,BR34,0)","v":0},{"$f":"IF(BS35=5,BS34,0)","v":0},{"$f":"IF(BT35=\"Touching2\",BT34,0)","v":0},{"$f":"IF(BU35=\"Touching3\",BU34,0)","v":0},{"$f":"IF(BV35=\"Trefoil\",BV34,0)","v":0},{"$f":"IF(BW35=\"Space\",BW34,0)","v":0},{"$f":"IF(BX35=2,BX34,0)","v":0},{"$f":"IF(BY35=3,BY34,0)","v":0},{"$f":"IF(BZ35=4,BZ34,0)","v":0},{"$f":"IF(CA35=5,CA34,0)","v":0},{"$f":"IF(CB35=4,CB34,0)","v":0},{"$f":"IF(CC35=\"Touching2\",CC34,0)","v":0},{"$f":"IF(CD35=\"Touching3\",CD34,0)","v":0},{"$f":"IF(CE35=\"Trefoil\",CE34,0)","v":0},{"$f":"IF(CF35=\"Space\",CF34,0)","v":0},{"$f":"IF(CG35=2,CG34,0)","v":0},{"$f":"IF(CH35=3,CH34,0)","v":0},{"$f":"IF(CI35=4,CI34,0)","v":0},{"$f":"IF(CJ35=\"Touching2\",CJ34,0)","v":0},{"$f":"IF(CK35=\"Touching3\",CK34,0)","v":0},{"$f":"IF(CL35=\"Trefoil\",CL34,0)","v":0},{"$f":"IF(CM35=\"Space\",CM34,0)","v":0},{"$f":"IF(CN35=2,CN34,0)","v":0},{"$f":"IF(CO35=3,CO34,0)","v":0},{"$f":"IF(CP35=4,CP34,0)","v":0},{"$f":"IF(CQ35=4,CQ34,0)","v":0},{"$f":"IF(CR35=\"Touching2\",CR34,0)","v":0},{"$f":"IF(CS35=\"Touching3\",CS34,0)","v":0},{"$f":"IF(CT35=\"Trefoil\",CT34,0)","v":0},{"$f":"IF(CU35=\"Space\",CU34,0)","v":0},{"$f":"IF(CV35=2,CV34,0)","v":0},{"$f":"IF(CW35=3,CW34,0)","v":0},{"$f":"IF(CX35=4,CX34,0)","v":0},{"$f":"IF(CY35=5,CY34,0)","v":0},{"$f":"IF(CZ35=\"Touching2\",CZ34,0)","v":0},{"$f":"IF(DA35=\"Touching3\",DA34,0)","v":0},{"$f":"IF(DB35=\"Trefoil\",DB34,0)","v":0},{"$f":"IF(DC35=\"Space\",DC34,0)","v":0},{"$f":"IF(DD35=2,DD34,0)","v":0},{"$f":"IF(DE35=3,DE34,0)","v":0},{"$f":"IF(DF35=4,DF34,0)","v":0},{"$f":"IF(DG35=4,DG34,0)","v":0},{"$f":"IF(DH35=\"Touching2\",DH34,0)","v":0},{"$f":"IF(DI35=\"Touching3\",DI34,0)","v":0},{"$f":"IF(DJ35=\"Trefoil\",DJ34,0)","v":0},{"$f":"IF(DK35=\"Space\",DK34,0)","v":390},{"$f":"IF(DL35=2,DL34,0)","v":0},{"$f":"IF(DM35=3,DM34,0)","v":0},{"$f":"IF(DN35=4,DN34,0)","v":0},{"$f":"IF(DO35=\"Touching2\",DO34,0)","v":0},{"$f":"IF(DP35=\"Touching3\",DP34,0)","v":0},{"$f":"IF(DQ35=\"Trefoil\",DQ34,0)","v":0},{"$f":"IF(DR35=\"Space\",DR34,0)","v":0},{"$f":"IF(DS35=2,DS34,0)","v":0},{"$f":"IF(DT35=3,DT34,0)","v":0},{"$f":"IF(DU35=4,DU34,0)","v":0},{"$f":"IF(DV35=4,DV34,0)","v":0},{"$f":"IF(DW35=\"Touching2\",DW34,0)","v":0},{"$f":"IF(DX35=\"Touching3\",DX34,0)","v":0},{"$f":"IF(DY35=\"Trefoil\",DY34,0)","v":0},{"$f":"IF(DZ35=\"Space\",DZ34,0)","v":0},{"$f":"IF(EA35=2,EA34,0)","v":0},{"$f":"IF(EB35=3,EB34,0)","v":0},{"$f":"IF(EC35=4,EC34,0)","v":0},{"$f":"IF(ED35=\"Touching2\",ED34,0)","v":0},{"$f":"IF(EE35=\"Touching3\",EE34,0)","v":0},{"$f":"IF(EF35=\"Trefoil\",EF34,0)","v":0},{"$f":"IF(EG35=\"Space\",EG34,0)","v":0},{"$f":"IF(EH35=2,EH34,0)","v":0},{"$f":"IF(EI35=3,EI34,0)","v":0},{"$f":"IF(EJ35=4,EJ34,0)","v":0},{"$f":"IF(EK35=4,EK34,0)","v":0},{"$f":"IF(EL35=\"Touching2\",EL34,0)","v":0},{"$f":"IF(EM35=\"Touching3\",EM34,0)","v":0},{"$f":"IF(EN35=\"Trefoil\",EN34,0)","v":0},{"$f":"IF(EO35=\"Space\",EO34,0)","v":0},{"$f":"IF(EP35=2,EP34,0)","v":0},{"$f":"IF(EQ35=3,EQ34,0)","v":0},{"$f":"IF(ER35=4,ER34,0)","v":0},{"$f":"IF(ES35=\"Touching2\",ES34,0)","v":0},{"$f":"IF(ET35=\"Touching3\",ET34,0)","v":0},{"$f":"IF(EU35=\"Trefoil\",EU34,0)","v":0},{"$f":"IF(EV35=\"Space\",EV34,0)","v":0},{"$f":"IF(EW35=2,EW34,0)","v":0},{"$f":"IF(EX35=3,EX34,0)","v":0},{"$f":"IF(EY35=4,EY34,0)","v":0},{"$f":"IF(EZ35=4,EZ34,0)","v":0},{"$f":"IF(FA35=\"Touching2\",FA34,0)","v":0},{"$f":"IF(FB35=\"Touching3\",FB34,0)","v":0},{"$f":"IF(FC35=\"Trefoil\",FC34,0)","v":0},{"$f":"IF(FD35=\"Space\",FD34,0)","v":510},{"$f":"IF(FE35=2,FE34,0)","v":0},{"$f":"IF(FF35=3,FF34,0)","v":0},{"$f":"IF(FG35=4,FG34,0)","v":0},{"$f":"IF(FH35=\"Touching2\",FH34,0)","v":0},{"$f":"IF(FI35=\"Touching3\",FI34,0)","v":0},{"$f":"IF(FJ35=\"Trefoil\",FJ34,0)","v":0},{"$f":"IF(FK35=\"Space\",FK34,0)","v":0},{"$f":"IF(FL35=2,FL34,0)","v":0},{"$f":"IF(FM35=3,FM34,0)","v":0},{"$f":"IF(FN35=4,FN34,0)","v":0},{"$f":"IF(FO35=4,FO34,0)","v":0},{"$f":"IF(FP35=\"Touching2\",FP34,0)","v":0},{"$f":"IF(FQ35=\"Touching3\",FQ34,0)","v":0},{"$f":"IF(FR35=\"Trefoil\",FR34,0)","v":0},{"$f":"IF(FS35=\"Space\",FS34,0)","v":0},{"$f":"IF(FT35=2,FT34,0)","v":0},{"$f":"IF(FU35=3,FU34,0)","v":0},{"$f":"IF(FV35=4,FV34,0)","v":0},{"$f":"IF(FW35=5,FW34,0)","v":0},{"$f":"IF(FX35=\"Touching2\",FX34,0)","v":0},{"$f":"IF(FY35=\"Touching3\",FY34,0)","v":0},{"$f":"IF(FZ35=\"Trefoil\",FZ34,0)","v":0},{"$f":"IF(GA35=\"Space\",GA34,0)","v":0},{"$f":"IF(GB35=2,GB34,0)","v":0},{"$f":"IF(GC35=3,GC34,0)","v":0},{"$f":"IF(GD35=4,GD34,0)","v":0},{"$f":"IF(GE35=5,GE34,0)","v":0},{"$f":"IF(GF35=4,GF34,0)","v":0},{"$f":"IF(GG35=\"Touching2\",GG34,0)","v":0},{"$f":"IF(GH35=\"Touching3\",GH34,0)","v":0},{"$f":"IF(GI35=\"Trefoil\",GI34,0)","v":0},{"$f":"IF(GJ35=\"Space\",GJ34,0)","v":521},{"$f":"IF(GK35=2,GK34,0)","v":0},{"$f":"IF(GL35=3,GL34,0)","v":0},{"$f":"IF(GM35=4,GM34,0)","v":0},{"$f":"IF(GN35=\"Touching2\",GN34,0)","v":0},{"$f":"IF(GO35=\"Touching3\",GO34,0)","v":0},{"$f":"IF(GP35=\"Trefoil\",GP34,0)","v":0},{"$f":"IF(GQ35=\"Space\",GQ34,0)","v":0},{"$f":"IF(GR35=2,GR34,0)","v":0},{"$f":"IF(GS35=3,GS34,0)","v":0},{"$f":"IF(GT35=4,GT34,0)","v":0},{"$f":"IF(GU35=4,GU34,0)","v":0},{"$f":"IF(GV35=\"Touching2\",GV34,0)","v":0},{"$f":"IF(GW35=\"Touching3\",GW34,0)","v":0},{"$f":"IF(GX35=\"Trefoil\",GX34,0)","v":0},{"$f":"IF(GY35=\"Space\",GY34,0)","v":518},{"$f":"IF(GZ35=2,GZ34,0)","v":0},{"$f":"IF(HA35=3,HA34,0)","v":0},{"$f":"IF(HB35=4,HB34,0)","v":0},{"$f":"IF(HC35=\"Touching2\",HC34,0)","v":0},{"$f":"IF(HD35=\"Touching3\",HD34,0)","v":0},{"$f":"IF(HE35=\"Trefoil\",HE34,0)","v":0},{"$f":"IF(HF35=\"Space\",HF34,0)","v":0},{"$f":"IF(HG35=2,HG34,0)","v":0},{"$f":"IF(HH35=3,HH34,0)","v":0},{"$f":"IF(HI35=4,HI34,0)","v":0},{"$f":"IF(HJ35=4,HJ34,0)","v":0},{"$f":"IF(HK35=\"Touching2\",HK34,0)","v":0},{"$f":"IF(HL35=\"Touching3\",HL34,0)","v":0},{"$f":"IF(HM35=\"Trefoil\",HM34,0)","v":0},{"$f":"IF(HN35=\"Space\",HN34,0)","v":518},{"$f":"IF(HO35=2,HO34,0)","v":0},{"$f":"IF(HP35=3,HP34,0)","v":0},{"$f":"IF(HQ35=4,HQ34,0)","v":0},{"$f":"IF(HR35=\"Touching2\",HR34,0)","v":0},{"$f":"IF(HS35=\"Touching3\",HS34,0)","v":0},{"$f":"IF(HT35=\"Trefoil\",HT34,0)","v":0},{"$f":"IF(HU35=\"Space\",HU34,0)","v":0},{"$f":"IF(HV35=2,HV34,0)","v":0},{"$f":"IF(HW35=3,HW34,0)","v":0},{"$f":"IF(HX35=4,HX34,0)","v":0},{"$f":"IF(HY35=4,HY34,0)","v":0},{"$f":"IF(HZ35=\"Touching2\",HZ34,0)","v":0},{"$f":"IF(IA35=\"Touching3\",IA34,0)","v":0},{"$f":"IF(IB35=\"Trefoil\",IB34,0)","v":0},{"$f":"IF(IC35=\"Space\",IC34,0)","v":517},{"$f":"IF(ID35=2,ID34,0)","v":0},{"$f":"IF(IE35=3,IE34,0)","v":0},{"$f":"IF(IF35=4,IF34,0)","v":0},{"$f":"IF(IG35=\"Touching2\",IG34,0)","v":0},{"$f":"IF(IH35=\"Touching3\",IH34,0)","v":0},{"$f":"IF(II35=\"Trefoil\",II34,0)","v":0},{"$f":"IF(IJ35=\"Space\",IJ34,0)","v":0},{"$f":"IF(IK35=2,IK34,0)","v":0},{"$f":"IF(IL35=3,IL34,0)","v":0},{"$f":"IF(IM35=4,IM34,0)","v":0},{"$f":"IF(IN35=4,IN34,0)","v":0},{"$f":"IF(IO35=\"Touching2\",IO34,0)","v":0},{"$f":"IF(IP35=\"Touching3\",IP34,0)","v":0},{"$f":"IF(IQ35=\"Trefoil\",IQ34,0)","v":0},{"$f":"IF(IR35=\"Space\",IR34,0)","v":516},{"$f":"IF(IS35=2,IS34,0)","v":0},{"$f":"IF(IT35=3,IT34,0)","v":0},{"$f":"IF(IU35=4,IU34,0)","v":0},{"$f":"IF(IV35=\"Touching2\",IV34,0)","v":0},{"$f":"IF(IW35=\"Touching3\",IW34,0)","v":0},{"$f":"IF(IX35=\"Trefoil\",IX34,0)","v":0},{"$f":"IF(IY35=\"Space\",IY34,0)","v":0},{"$f":"IF(IZ35=2,IZ34,0)","v":0},{"$f":"IF(JA35=3,JA34,0)","v":0},{"$f":"IF(JB35=4,JB34,0)","v":0},{"$f":"IF(JC35=4,JC34,0)","v":0},{"$f":"IF(JD35=\"Touching2\",JD34,0)","v":0},{"$f":"IF(JE35=\"Touching3\",JE34,0)","v":0},{"$f":"IF(JF35=\"Trefoil\",JF34,0)","v":0},{"$f":"IF(JG35=\"Space\",JG34,0)","v":510},{"$f":"IF(JH35=2,JH34,0)","v":0},{"$f":"IF(JI35=3,JI34,0)","v":0},{"$f":"IF(JJ35=4,JJ34,0)","v":0},{"$f":"IF(JK35=\"Touching2\",JK34,0)","v":0},{"$f":"IF(JL35=\"Touching3\",JL34,0)","v":0},{"$f":"IF(JM35=\"Trefoil\",JM34,0)","v":0},{"$f":"IF(JN35=\"Space\",JN34,0)","v":0},{"$f":"IF(JO35=2,JO34,0)","v":0},{"$f":"IF(JP35=3,JP34,0)","v":0},{"$f":"IF(JQ35=4,JQ34,0)","v":0},{"$f":"IF(JR35=4,JR34,0)","v":0},{"$f":"IF(JS35=\"Touching2\",JS34,0)","v":0},{"$f":"IF(JT35=\"Touching3\",JT34,0)","v":0},{"$f":"IF(JU35=\"Trefoil\",JU34,0)","v":0},{"$f":"IF(JV35=\"Space\",JV34,0)","v":0},{"$f":"IF(JW35=2,JW34,0)","v":0},{"$f":"IF(JX35=3,JX34,0)","v":0},{"$f":"IF(JY35=4,JY34,0)","v":0},{"$f":"IF(JZ35=\"Touching2\",JZ34,0)","v":0},{"$f":"IF(KA35=\"Touching3\",KA34,0)","v":0},{"$f":"IF(KB35=\"Trefoil\",KB34,0)","v":0},{"$f":"IF(KC35=\"Space\",KC34,0)","v":0},{"$f":"IF(KD35=2,KD34,0)","v":0},{"$f":"IF(KE35=3,KE34,0)","v":0},{"$f":"IF(KF35=4,KF34,0)","v":0},{"$f":"IF(KG35=4,KG34,0)","v":0},{"$f":"IF(KH35=\"Touching2\",KH34,0)","v":0},{"$f":"IF(KI35=\"Touching3\",KI34,0)","v":0},{"$f":"IF(KJ35=\"Trefoil\",KJ34,0)","v":0},{"$f":"IF(KK35=\"Space\",KK34,0)","v":0},{"$f":"IF(KL35=2,KL34,0)","v":0},{"$f":"IF(KM35=3,KM34,0)","v":0},{"$f":"IF(KN35=4,KN34,0)","v":0},{"$f":"IF(KO35=\"Touching2\",KO34,0)","v":0},{"$f":"IF(KP35=\"Touching3\",KP34,0)","v":0},{"$f":"IF(KQ35=\"Trefoil\",KQ34,0)","v":0},{"$f":"IF(KR35=\"Space\",KR34,0)","v":0},{"$f":"IF(KS35=2,KS34,0)","v":0},{"$f":"IF(KT35=3,KT34,0)","v":0},{"$f":"IF(KU35=4,KU34,0)","v":0},{"$f":"IF(KV35=4,KV34,0)","v":0},{"$f":"IF(KW35=\"Touching2\",KW34,0)","v":0},{"$f":"IF(KX35=\"Touching3\",KX34,0)","v":0},{"$f":"IF(KY35=\"Trefoil\",KY34,0)","v":0},{"$f":"IF(KZ35=\"Space\",KZ34,0)","v":301.58109308336964},{"$f":"IF(LA35=2,LA34,0)","v":0},{"$f":"IF(LB35=3,LB34,0)","v":0},{"$f":"IF(LC35=4,LC34,0)","v":0},{"$f":"IF(LD35=\"Touching2\",LD34,0)","v":0},{"$f":"IF(LE35=\"Touching3\",LE34,0)","v":0},{"$f":"IF(LF35=\"Trefoil\",LF34,0)","v":0},{"$f":"IF(LG35=\"Space\",LG34,0)","v":0},{"$f":"IF(LH35=2,LH34,0)","v":0},{"$f":"IF(LI35=3,LI34,0)","v":0},{"$f":"IF(LJ35=4,LJ34,0)","v":0},{"$f":"IF(LK35=4,LK34,0)","v":0},{"$f":"IF(LL35=\"Touching2\",LL34,0)","v":0},{"$f":"IF(LM35=\"Touching3\",LM34,0)","v":0},{"$f":"IF(LN35=\"Trefoil\",LN34,0)","v":0},{"$f":"IF(LO35=\"Space\",LO34,0)","v":293.70421799729814},{"$f":"IF(LP35=2,LP34,0)","v":0},{"$f":"IF(LQ35=3,LQ34,0)","v":0},{"$f":"IF(LR35=4,LR34,0)","v":0},{"$f":"IF(LS35=\"Touching2\",LS34,0)","v":0},{"$f":"IF(LT35=\"Touching3\",LT34,0)","v":0},{"$f":"IF(LU35=\"Trefoil\",LU34,0)","v":0},{"$f":"IF(LV35=\"Space\",LV34,0)","v":0},{"$f":"IF(LW35=2,LW34,0)","v":0},{"$f":"IF(LX35=3,LX34,0)","v":0},{"$f":"IF(LY35=4,LY34,0)","v":0},{"$f":"IF(LZ35=4,LZ34,0)","v":0},{"$f":"IF(MA35=\"Touching2\",MA34,0)","v":0},{"$f":"IF(MB35=\"Touching3\",MB34,0)","v":0},{"$f":"IF(MC35=\"Trefoil\",MC34,0)","v":0},{"$f":"IF(MD35=\"Space\",MD34,0)","v":405},{"$f":"IF(ME35=2,ME34,0)","v":0},{"$f":"IF(MF35=3,MF34,0)","v":0},{"$f":"IF(MG35=4,MG34,0)","v":0},{"$f":"IF(MH35=\"Touching2\",MH34,0)","v":0},{"$f":"IF(MI35=\"Touching3\",MI34,0)","v":0},{"$f":"IF(MJ35=\"Trefoil\",MJ34,0)","v":0},{"$f":"IF(MK35=\"Space\",MK34,0)","v":0},{"$f":"IF(ML35=2,ML34,0)","v":0},{"$f":"IF(MM35=3,MM34,0)","v":0},{"$f":"IF(MN35=4,MN34,0)","v":0},{"$f":"IF(MO35=4,MO34,0)","v":0},{"$f":"IF(MP35=\"Touching2\",MP34,0)","v":0},{"$f":"IF(MQ35=\"Touching3\",MQ34,0)","v":0},{"$f":"IF(MR35=\"Trefoil\",MR34,0)","v":0},{"$f":"IF(MS35=\"Space\",MS34,0)","v":402},{"$f":"IF(MT35=2,MT34,0)","v":0},{"$f":"IF(MU35=3,MU34,0)","v":0},{"$f":"IF(MV35=4,MV34,0)","v":0},{"$f":"IF(MW35=\"Touching2\",MW34,0)","v":0},{"$f":"IF(MX35=\"Touching3\",MX34,0)","v":0},{"$f":"IF(MY35=\"Trefoil\",MY34,0)","v":0},{"$f":"IF(MZ35=\"Space\",MZ34,0)","v":0},{"$f":"IF(NA35=2,NA34,0)","v":0},{"$f":"IF(NB35=3,NB34,0)","v":0},{"$f":"IF(NC35=4,NC34,0)","v":0},{"$f":"IF(ND35=4,ND34,0)","v":0},{"$f":"IF(NE35=\"Touching2\",NE34,0)","v":0},{"$f":"IF(NF35=\"Touching3\",NF34,0)","v":0},{"$f":"IF(NG35=\"Trefoil\",NG34,0)","v":0},{"$f":"IF(NH35=\"Space\",NH34,0)","v":464},{"$f":"IF(NI35=2,NI34,0)","v":0},{"$f":"IF(NJ35=3,NJ34,0)","v":0},{"$f":"IF(NK35=4,NK34,0)","v":0},{"$f":"IF(NL35=\"Touching2\",NL34,0)","v":0},{"$f":"IF(NM35=\"Touching3\",NM34,0)","v":0},{"$f":"IF(NN35=\"Trefoil\",NN34,0)","v":0},{"$f":"IF(NO35=\"Space\",NO34,0)","v":0},{"$f":"IF(NP35=2,NP34,0)","v":0},{"$f":"IF(NQ35=3,NQ34,0)","v":0},{"$f":"IF(NR35=4,NR34,0)","v":0},{"$f":"IF(NS35=4,NS34,0)","v":0},{"$f":"IF(NT35=\"Touching2\",NT34,0)","v":0},{"$f":"IF(NU35=\"Touching3\",NU34,0)","v":0},{"$f":"IF(NV35=\"Trefoil\",NV34,0)","v":0},{"$f":"IF(NW35=\"Space\",NW34,0)","v":393},{"$f":"IF(NX35=2,NX34,0)","v":0},{"$f":"IF(NY35=3,NY34,0)","v":0},{"$f":"IF(NZ35=4,NZ34,0)","v":0},{"$f":"IF(OA35=\"Touching2\",OA34,0)","v":0},{"$f":"IF(OB35=\"Touching3\",OB34,0)","v":0},{"$f":"IF(OC35=\"Trefoil\",OC34,0)","v":0},{"$f":"IF(OD35=\"Space\",OD34,0)","v":0},{"$f":"IF(OE35=2,OE34,0)","v":0},{"$f":"IF(OF35=3,OF34,0)","v":0},{"$f":"IF(OG35=4,OG34,0)","v":0},{"$f":"IF(OH35=4,OH34,0)","v":0},{"$f":"IF(OI35=\"Touching2\",OI34,0)","v":0},{"$f":"IF(OJ35=\"Touching3\",OJ34,0)","v":0},{"$f":"IF(OK35=\"Trefoil\",OK34,0)","v":0},{"$f":"IF(OL35=\"Space\",OL34,0)","v":0},{"$f":"IF(OM35=2,OM34,0)","v":0},{"$f":"IF(ON35=3,ON34,0)","v":0},{"$f":"IF(OO35=4,OO34,0)","v":0},{"$f":"IF(OP35=\"Touching2\",OP34,0)","v":0},{"$f":"IF(OQ35=\"Touching3\",OQ34,0)","v":0},{"$f":"IF(OR35=\"Trefoil\",OR34,0)","v":0},{"$f":"IF(OS35=\"Space\",OS34,0)","v":0},{"$f":"IF(OT35=2,OT34,0)","v":0},{"$f":"IF(OU35=3,OU34,0)","v":0},{"$f":"IF(OV35=4,OV34,0)","v":0}]
[]
[null,null,"Current USE",{"$f":"MAX(D36:Q36)","v":391},null,null,null,null,null,null,null,null,null,null,null,null,null,"Current USE",{"$f":"MAX(S36:AF36)","v":396},null,null,null,null,null,null,null,null,null,null,null,null,null,"Current USE",{"$f":"MAX(AH36:AU36)","v":0},null,null,null,null,null,null,null,null,null,null,null,null,null,"Current USE",{"$f":"MAX(AW36:BJ36)","v":0},null,null,null,null,null,null,null,null,null,null,null,null,null,"Current USE",{"$f":"MAX(BL36:BZ36)","v":0},null,null,null,null,null,null,null,null,null,null,null,null,null,null,null,"Current USE",{"$f":"MAX(CC36:CP36)","v":0},null,null,null,null,null,null,null,null,null,null,null,null,null,"Current USE",{"$f":"MAX(CR36:DF36)","v":0},null,null,null,null,null,null,null,null,null,null,null,null,null,null,"Current USE",{"$f":"MAX(DH36:DU36)","v":390},null,null,null,null,null,null,null,null,null,null,null,null,null,"Current USE",{"$f":"MAX(DW36:EJ36)","v":0},null,null,null,null,null,null,null,null,null,null,null,null,null,"Current USE",{"$f":"MAX(EL36:EY36)","v":0},null,null,null,null,null,null,null,null,null,null,null,null,null,"Current USE",{"$f":"MAX(FA36:FN36)","v":510},null,null,null,null,null,null,null,null,null,null,null,null,null,"Current USE",{"$f":"MAX(FP36:GD36)","v":0},null,null,null,null,null,null,null,null,null,null,null,null,null,null,null,"Current USE",{"$f":"MAX(GG36:GT36)","v":521},null,null,null,null,null,null,null,null,null,null,null,null,null,"Current USE",{"$f":"MAX(GV36:HI36)","v":518},null,null,null,null,null,null,null,null,null,null,null,null,null,"Current USE",{"$f":"MAX(HK36:HX36)","v":518},null,null,null,null,null,null,null,null,null,null,null,null,null,"Current USE",{"$f":"MAX(HZ36:IM36)","v":517},null,null,null,null,null,null,null,null,null,null,null,null,null,"Current USE",{"$f":"MAX(IO36:JB36)","v":516},null,null,null,null,null,null,null,null,null,null,null,null,null,"Current USE",{"$f":"MAX(JD36:JQ36)","v":510},null,null,null,null,null,null,null,null,null,null,null,null,null,"Current USE",{"$f":"MAX(JS36:KF36)","v":0},null,null,null,null,null,null,null,null,null,null,null,null,null,"Current USE",{"$f":"MAX(KH36:KU36)","v":0},null,null,null,null,null,null,null,null,null,null,null,null,null,"Current USE",{"$f":"MAX(KW36:LJ36)","v":301.58109308336964},null,null,null,null,null,null,null,null,null,null,null,null,null,"Current USE",{"$f":"MAX(LL36:LY36)","v":293.70421799729814},null,null,null,null,null,null,null,null,null,null,null,null,null,"Current USE",{"$f":"MAX(MA36:MN36)","v":405},null,null,null,null,null,null,null,null,null,null,null,null,null,"Current USE",{"$f":"MAX(MP36:NC36)","v":402},null,null,null,null,null,null,null,null,null,null,null,null,null,"Current USE",{"$f":"MAX(NE36:NR36)","v":464},null,null,null,null,null,null,null,null,null,null,null,null,null,"Current USE",{"$f":"MAX(NT36:OG36)","v":393},null,null,null,null,null,null,null,null,null,null,null,null,null,"Current USE",{"$f":"MAX(OI36:OV36)","v":0}]
[]
[]
[]
[]
[]
["Cable Name",{"$f":"Interface!C13","v":"60227 IEC 01 THW"},"Choose Size"]
["Core",{"$f":"Interface!C15","v":1},{"$f":"IF(B46=0.5,1,IF(B46=0.75,2,IF(B46=1,3,IF(B46=1.5,4,IF(B46=2.5,5,IF(B46=4,6,IF(B46=6,7,IF(B46=10,8,IF(B46=16,9,IF(B46=25,10,IF(B46=35,11,IF(B46=50,12,IF(B46=70,13,IF(B46=95,14,IF(B46=120,15,IF(B46=150,16,IF(B46=185,17,IF(B46=240,18,IF(B46=300,19,IF(B46=400,20,IF(B46=500,21,IF(B46=630,22,IF(B46=800,23,IF(B46=1000,24,\"\"))))))))))))))))))))))))","v":16}]
["Size",{"$f":"D!F38","v":150}]
["Installation",{"$f":"D!F67","v":"Space"},{"$f":"IF(AND(B51=1,B47=\"Touching\"),\"Touching2\",IF(AND(B51=2,B47=\"Touching\"),\"Touching3\",B47))","v":"Space"}]
["Condition",{"$f":"Interface!G35","v":"Air"},{"$f":"D!S65","v":1}]
["Status Cable",{"$f":"D!F40","v":1}]
["Current",{"$f":"CHOOSE(B49,D38,S38,AH38,AW38,BL38,CC38,CR38,DH38,DW38,EL38,FA38,FP38,GG38,GV38,HK38,HZ38,IO38,JD38,JS38,KH38,KW38,LL38,MA38,MP38,NE38,NT38,OI38)","v":391}]
["Check 1-3 Phase",{"$f":"D!C34","v":2}]

{"sheet":"Sheet2","index":8,"n_rows":30,"n_cols":14,"rows_kept":30,"cut":false,"hidden":true,"merged":[[7,5,7,10]]}
["Air","M","M3","M4",null,null,null,null,null,null,null,"Air","Air","Ground"]
["Ground","31-35","11-15","11-15",null,null,null,null,null,null,null,null,"Ground"]
[null,"36-40","16-20","16-20"]
[null,"41-45","21-25","21-25"]
[null,"46-50","26-30","26-30"]
["Korn","51-55","31-35","31-35"]
[null,null,"36-40","36-40"]
[null,null,"41-45","41-45"]
[null,null,"46-50","46-50"]
[null,null,"51-55","51-55"]
[null,null,"56-60","56-60"]
[null,null,"61-65"]
[null,null,"66-70"]
[null,null,"71-75"]
[null,null,"76-80"]
[]
[]
[]
[]
[null,"AIR PVC  TIS","AIR XLPE IEC","GROUND PVC IEC"]
[]
[null,"1=TIS"]
[null,"2=IEC"]
["TIS/IEC",{"$f":"D!K66","v":1}]
["Status",{"$f":"D!F40","v":1}]
["Installation",{"$f":"Interface!G35","v":"Air"}]
["Amp.",{"$f":"Interface!G37","v":"N/A"}]
[null,"31-35"]
[]
[null,null,null,null,{"$f":"OUTPUT!P20","v":0}]

{"sheet":"In-air-GRD","index":9,"n_rows":45,"n_cols":11,"rows_kept":45,"cut":false,"hidden":true,"merged":[[2,3,2,4],[2,1,3,1],[22,2,22,4]]}
[]
[null,"ตัวปรับแตกต่าง 40°C Air "]
[null,"Amb.Temp","TIS","IEC"]
[null,null,"PVC","PVC ","XLPE"]
[null,"11-15",null,1.34,1.23]
[null,"16-20",null,1.29,1.19]
[null,"21-25",null,1.22,1.1399999999999999,null,"Cable STD",null,{"$f":"D!K66","v":1},null,"*1TIS,2IEC"]
[null,"26-30",null,1.1499999999999999,1.1000000000000001,null,"Cable TYPE",null,{"$f":"D!F40","v":1}]
[null,"31-35",1.1100000000000001,1.08,1.05,null,"Air / Ground",null,{"$f":"Interface!G35","v":"Air"}]
[null,"36-40",1,1,1,null,"Amp",null,{"$f":"Sheet1!B50","v":391}]
[null,"41-45",0.87,0.91,0.96,null,"Temp",{"$f":"Interface!G39","v":"41-45"},{"$f":"IF(I9=\"AIR\",C23,IF(I9=\"ground\",C45,\"\"))","v":0.87}]
[null,"46-50",0.71,0.82,0.9,null,"Core",{"$f":"D!F36","v":1}]
[null,"51-55",0.5,0.7,0.84,null,"Check",{"$f":"IF(H12=1,\"Single\",IF(H12>1,\"Multi\"))","v":"Single"}]
[null,"56-60",null,0.56999999999999995,0.78,null,null,{"$f":"I10*I11","v":340.17}]
[null,"61-65",null,null,0.71]
[null,"66-70",null,null,0.64]
[null,"71-75",null,null,0.55000000000000004]
[null,"76-80",null,null,0.45]
[null,"81-85"]
[null,"86-90"]
[null,"91-95"]
[null,null,{"$f":"VLOOKUP(H11,B5:E21,2,FALSE)","v":0.87},{"$f":"VLOOKUP(H11,B5:E21,3,FALSE)","v":0.91},{"$f":"VLOOKUP(H11,B5:E21,4,FALSE)","v":0.96}]
[null,"USE",{"$f":"IF(I7=1,C22,IF(I7=2,E22))","v":0.87}]
[]
[]
[null,"ตัวปรับแตกต่าง 30°C IEC (in-ground)"]
[null,"Amb.Temp","XLPE"]
[null,"11-15",1.1200000000000001]
[null,"16-20",1.08]
[null,"21-25",1.03]
[null,"26-30",1]
[null,"31-35",0.96]
[null,"36-40",0.91]
[null,"41-45",0.86]
[null,"46-50",0.82]
[null,"51-55",0.76]
[null,"56-60",0.7]
[null,"61-65",0.65]
[null,"66-70",0.56999999999999995]
[null,"71-75",0.49]
[null,"76-80",0.41]
[null,"81-85"]
[null,"86-90"]
[null,"91-95"]
[null,null,{"$f":"VLOOKUP(H11,B28:C44,2,FALSE)","v":0.86}]

{"sheet":"Sheet4","index":10,"n_rows":16,"n_cols":21,"rows_kept":16,"cut":false,"hidden":true,"merged":[[0,1,0,3],[14,1,14,3]]}
["Cable Name","Core x Size",null,null,"laying type","P.F.","Type of Voltage Drop","Cable/Phase","Length","Current","Voltage system","Part of system","Voltage drop","% Voltage","Installation","Maximum capacity","Ambient","Result","Check",null,"Define ฟายเอ้ย"]
[{"$f":"Interface!C13","v":"60227 IEC 01 THW"},{"$f":"D!F36","v":1},"x",{"$f":"D!F38","v":150},{"$f":"D!F67","v":"Space"},{"$f":"Interface!C28","v":0.85},{"$f":"Interface!C9","v":"AC 3-Phase,  3-Wire"},{"$f":"Interface!C33","v":6},{"$f":"Interface!C35","v":99},{"$f":"Interface!C37","v":99},{"$f":"Interface!C39","v":400},{"$f":"Interface!C31","v":"Main Feeder"},{"$f":"Interface!C41","v":0.55679309242507635},{"$f":"Interface!C43","v":0.13919827310626909},{"$f":"Interface!G35","v":"Air"},{"$f":"Interface!G37","v":"N/A"},{"$f":"Interface!G39","v":"41-45"},{"$f":"Interface!C45","v":"Can Use"},null,null,9]
[]
[]
[]
[]
[]
[]
[]
[]
[]
[]
[null,null,null,null,null,null,null,null,"Timer",3,"count",{"$f":"COUNTA(OUTPUT!B:B)-2","v":-1}]
[]
["Cable Name","Core x Size",null,null,"laying type","P.F.","Type of Voltage Drop","Cable/Phase","Length","Current","Voltage system","Part of system","Voltage drop","% Voltage","Installation","Maximum capacity","Ambient","Result"]
[{"$f":"OFFSET(OUTPUT!A7,J13,0,1,1)","v":0},{"$f":"OFFSET(OUTPUT!B7,J13,0,1,1)","v":0},{"$f":"OFFSET(OUTPUT!C7,J13,0,1,1)","v":0},{"$f":"OFFSET(OUTPUT!D7,J13,0,1,1)","v":0},{"$f":"OFFSET(OUTPUT!E7,J13,0,1,1)","v":0},{"$f":"OFFSET(OUTPUT!F7,J13,0,1,1)","v":0},{"$f":"OFFSET(OUTPUT!G7,J13,0,1,1)","v":0},{"$f":"OFFSET(OUTPUT!H7,J13,0,1,1)","v":0},{"$f":"OFFSET(OUTPUT!I7,J13,0,1,1)","v":0},{"$f":"OFFSET(OUTPUT!J7,J13,0,1,1)","v":0},{"$f":"OFFSET(OUTPUT!K7,J13,0,1,1)","v":0},{"$f":"OFFSET(OUTPUT!L7,J13,0,1,1)","v":0},{"$f":"OFFSET(OUTPUT!M7,J13,0,1,1)","v":0},{"$f":"OFFSET(OUTPUT!N7,J13,0,1,1)","v":0},{"$f":"OFFSET(OUTPUT!O7,J13,0,1,1)","v":0},{"$f":"OFFSET(OUTPUT!P7,J13,0,1,1)","v":0},{"$f":"OFFSET(OUTPUT!Q7,J13,0,1,1)","v":0},{"$f":"OFFSET(OUTPUT!R7,J13,0,1,1)","v":0},null,{"$f":"OFFSET(OUTPUT!T7,Sheet4!J13,0,1,1)","v":true}]